[jpos-users] jposee : gradle install error

classic Classic list List threaded Threaded
18 messages Options
Reply | Threaded
Open this post in threaded view
|

[jpos-users] jposee : gradle install error

Janta Darbar
my laptop is windows 10.

I downloaded the JPosEE Master and tried to Gradle install.

I am using gradle 3.5
java JDK : 1.8.0_121

>gradle install

It is throwing error as follows:

:modules:qi-core:vaadinCompile
Unexpected internal compiler error
java.lang.RuntimeException: Unexpectedly unable to access Enum.createValueOfMap via reflection. Likely a dependency on the com.google.gwt.user.User module is missing.
at com.google.gwt.dev.jjs.impl.GwtAstBuilder$AstVisitor.writeEnumValueOfMethod(GwtAstBuilder.java:2793)
at com.google.gwt.dev.jjs.impl.GwtAstBuilder$AstVisitor.processEnumType(GwtAstBuilder.java:2425)
at com.google.gwt.dev.jjs.impl.GwtAstBuilder$AstVisitor.endVisit(GwtAstBuilder.java:1861)
at com.google.gwt.dev.jjs.impl.GwtAstBuilder$AstVisitor.endVisit(GwtAstBuilder.java:1588)
at org.eclipse.jdt.internal.compiler.ast.TypeDeclaration.traverse(TypeDeclaration.java:1382)
at com.google.gwt.dev.jjs.impl.GwtAstBuilder.process(GwtAstBuilder.java:3058)
at com.google.gwt.dev.javac.CompilationStateBuilder$CompileMoreLater$UnitProcessorImpl.process(CompilationStateBuilder.java:141)
at com.google.gwt.dev.javac.JdtCompiler$CompilerImpl.process(JdtCompiler.java:384)
at org.eclipse.jdt.internal.compiler.Compiler.compile(Compiler.java:470)
at com.google.gwt.dev.javac.JdtCompiler.doCompile(JdtCompiler.java:985)
at com.google.gwt.dev.javac.CompilationStateBuilder$CompileMoreLater.compile(CompilationStateBuilder.java:339)
at com.google.gwt.dev.javac.CompilationStateBuilder.doBuildFrom(CompilationStateBuilder.java:580)
at com.google.gwt.dev.javac.CompilationStateBuilder.buildFrom(CompilationStateBuilder.java:513)
at com.google.gwt.dev.javac.CompilationStateBuilder.buildFrom(CompilationStateBuilder.java:499)
at com.google.gwt.dev.cfg.ModuleDef.getCompilationState(ModuleDef.java:668)
at com.google.gwt.dev.Precompile.precompile(Precompile.java:255)
at com.google.gwt.dev.Precompile.precompile(Precompile.java:229)
at com.google.gwt.dev.Precompile.precompile(Precompile.java:145)
at com.google.gwt.dev.Compiler.run(Compiler.java:206)
at com.google.gwt.dev.Compiler.run(Compiler.java:158)
at com.google.gwt.dev.Compiler$1.run(Compiler.java:120)
at com.google.gwt.dev.CompileTaskRunner.doRun(CompileTaskRunner.java:55)
at com.google.gwt.dev.CompileTaskRunner.runWithAppropriateLogger(CompileTaskRunner.java:50)
at com.google.gwt.dev.Compiler.main(Compiler.java:127)
:modules:qi-core:vaadinCompile FAILED

FAILURE: Build failed with an exception.

* What went wrong:
Execution failed for task ':modules:qi-core:vaadinCompile'.
> Widgetset failed to compile. See error log.


Am I missing anything??

- Rajesh

--
--
jPOS is licensed under AGPL - free for community usage for your open-source project. Licenses are also available for commercial usage. Please support jPOS, contact: [hidden email]
---
You received this message because you are subscribed to the Google Groups "jPOS Users" group.
To unsubscribe from this group and stop receiving emails from it, send an email to [hidden email].
To post to this group, send email to [hidden email].
To view this discussion on the web visit https://groups.google.com/d/msgid/jpos-users/b0cf51c4-3016-44ec-a55e-9f55e26bb839%40googlegroups.com.
For more options, visit https://groups.google.com/d/optout.
Reply | Threaded
Open this post in threaded view
|

Re: [jpos-users] jposee : gradle install error

Luiz Felipph Calado
Raj,

Use gradle script that's ship with Jpos 




Felipph
Gerente de TI
MaxxCard
@mobile

Em 26 de abr de 2017 11:08 PM, "Janta Darbar" <[hidden email]> escreveu:
my laptop is windows 10.

I downloaded the JPosEE Master and tried to Gradle install.

I am using gradle 3.5
java JDK : 1.8.0_121

>gradle install

It is throwing error as follows:

:modules:qi-core:vaadinCompile
Unexpected internal compiler error
java.lang.RuntimeException: Unexpectedly unable to access Enum.createValueOfMap via reflection. Likely a dependency on the com.google.gwt.user.User module is missing.
at com.google.gwt.dev.jjs.impl.GwtAstBuilder$AstVisitor.writeEnumValueOfMethod(GwtAstBuilder.java:2793)
at com.google.gwt.dev.jjs.impl.GwtAstBuilder$AstVisitor.processEnumType(GwtAstBuilder.java:2425)
at com.google.gwt.dev.jjs.impl.GwtAstBuilder$AstVisitor.endVisit(GwtAstBuilder.java:1861)
at com.google.gwt.dev.jjs.impl.GwtAstBuilder$AstVisitor.endVisit(GwtAstBuilder.java:1588)
at org.eclipse.jdt.internal.compiler.ast.TypeDeclaration.traverse(TypeDeclaration.java:1382)
at com.google.gwt.dev.jjs.impl.GwtAstBuilder.process(GwtAstBuilder.java:3058)
at com.google.gwt.dev.javac.CompilationStateBuilder$CompileMoreLater$UnitProcessorImpl.process(CompilationStateBuilder.java:141)
at com.google.gwt.dev.javac.JdtCompiler$CompilerImpl.process(JdtCompiler.java:384)
at org.eclipse.jdt.internal.compiler.Compiler.compile(Compiler.java:470)
at com.google.gwt.dev.javac.JdtCompiler.doCompile(JdtCompiler.java:985)
at com.google.gwt.dev.javac.CompilationStateBuilder$CompileMoreLater.compile(CompilationStateBuilder.java:339)
at com.google.gwt.dev.javac.CompilationStateBuilder.doBuildFrom(CompilationStateBuilder.java:580)
at com.google.gwt.dev.javac.CompilationStateBuilder.buildFrom(CompilationStateBuilder.java:513)
at com.google.gwt.dev.javac.CompilationStateBuilder.buildFrom(CompilationStateBuilder.java:499)
at com.google.gwt.dev.cfg.ModuleDef.getCompilationState(ModuleDef.java:668)
at com.google.gwt.dev.Precompile.precompile(Precompile.java:255)
at com.google.gwt.dev.Precompile.precompile(Precompile.java:229)
at com.google.gwt.dev.Precompile.precompile(Precompile.java:145)
at com.google.gwt.dev.Compiler.run(Compiler.java:206)
at com.google.gwt.dev.Compiler.run(Compiler.java:158)
at com.google.gwt.dev.Compiler$1.run(Compiler.java:120)
at com.google.gwt.dev.CompileTaskRunner.doRun(CompileTaskRunner.java:55)
at com.google.gwt.dev.CompileTaskRunner.runWithAppropriateLogger(CompileTaskRunner.java:50)
at com.google.gwt.dev.Compiler.main(Compiler.java:127)
:modules:qi-core:vaadinCompile FAILED

FAILURE: Build failed with an exception.

* What went wrong:
Execution failed for task ':modules:qi-core:vaadinCompile'.
> Widgetset failed to compile. See error log.


Am I missing anything??

- Rajesh

--
--
jPOS is licensed under AGPL - free for community usage for your open-source project. Licenses are also available for commercial usage. Please support jPOS, contact: [hidden email]
---
You received this message because you are subscribed to the Google Groups "jPOS Users" group.
To unsubscribe from this group and stop receiving emails from it, send an email to [hidden email].
To post to this group, send email to [hidden email].
To view this discussion on the web visit https://groups.google.com/d/msgid/jpos-users/b0cf51c4-3016-44ec-a55e-9f55e26bb839%40googlegroups.com.
For more options, visit https://groups.google.com/d/optout.

--
--
jPOS is licensed under AGPL - free for community usage for your open-source project. Licenses are also available for commercial usage. Please support jPOS, contact: [hidden email]
---
You received this message because you are subscribed to the Google Groups "jPOS Users" group.
To unsubscribe from this group and stop receiving emails from it, send an email to [hidden email].
To post to this group, send email to [hidden email].
To view this discussion on the web visit https://groups.google.com/d/msgid/jpos-users/CABCV0cxC3r2NLN1DyzHJ07rCShZjQqD12fHGnkHjVoVbmc-ynw%40mail.gmail.com.
For more options, visit https://groups.google.com/d/optout.
Reply | Threaded
Open this post in threaded view
|

Re: [jpos-users] jposee : gradle install error

Alejandro Revilla
In reply to this post by Janta Darbar
Anybody else experiencing this problem?

It works for me in OSX and for Travis in Docker/Linux https://travis-ci.org/jpos/jPOS-EE/builds/225704892




On Wed, Apr 26, 2017 at 11:08 PM, Janta Darbar <[hidden email]> wrote:
my laptop is windows 10.

I downloaded the JPosEE Master and tried to Gradle install.

I am using gradle 3.5
java JDK : 1.8.0_121

>gradle install

It is throwing error as follows:

:modules:qi-core:vaadinCompile
Unexpected internal compiler error
java.lang.RuntimeException: Unexpectedly unable to access Enum.createValueOfMap via reflection. Likely a dependency on the com.google.gwt.user.User module is missing.
at com.google.gwt.dev.jjs.impl.GwtAstBuilder$AstVisitor.writeEnumValueOfMethod(GwtAstBuilder.java:2793)
at com.google.gwt.dev.jjs.impl.GwtAstBuilder$AstVisitor.processEnumType(GwtAstBuilder.java:2425)
at com.google.gwt.dev.jjs.impl.GwtAstBuilder$AstVisitor.endVisit(GwtAstBuilder.java:1861)
at com.google.gwt.dev.jjs.impl.GwtAstBuilder$AstVisitor.endVisit(GwtAstBuilder.java:1588)
at org.eclipse.jdt.internal.compiler.ast.TypeDeclaration.traverse(TypeDeclaration.java:1382)
at com.google.gwt.dev.jjs.impl.GwtAstBuilder.process(GwtAstBuilder.java:3058)
at com.google.gwt.dev.javac.CompilationStateBuilder$CompileMoreLater$UnitProcessorImpl.process(CompilationStateBuilder.java:141)
at com.google.gwt.dev.javac.JdtCompiler$CompilerImpl.process(JdtCompiler.java:384)
at org.eclipse.jdt.internal.compiler.Compiler.compile(Compiler.java:470)
at com.google.gwt.dev.javac.JdtCompiler.doCompile(JdtCompiler.java:985)
at com.google.gwt.dev.javac.CompilationStateBuilder$CompileMoreLater.compile(CompilationStateBuilder.java:339)
at com.google.gwt.dev.javac.CompilationStateBuilder.doBuildFrom(CompilationStateBuilder.java:580)
at com.google.gwt.dev.javac.CompilationStateBuilder.buildFrom(CompilationStateBuilder.java:513)
at com.google.gwt.dev.javac.CompilationStateBuilder.buildFrom(CompilationStateBuilder.java:499)
at com.google.gwt.dev.cfg.ModuleDef.getCompilationState(ModuleDef.java:668)
at com.google.gwt.dev.Precompile.precompile(Precompile.java:255)
at com.google.gwt.dev.Precompile.precompile(Precompile.java:229)
at com.google.gwt.dev.Precompile.precompile(Precompile.java:145)
at com.google.gwt.dev.Compiler.run(Compiler.java:206)
at com.google.gwt.dev.Compiler.run(Compiler.java:158)
at com.google.gwt.dev.Compiler$1.run(Compiler.java:120)
at com.google.gwt.dev.CompileTaskRunner.doRun(CompileTaskRunner.java:55)
at com.google.gwt.dev.CompileTaskRunner.runWithAppropriateLogger(CompileTaskRunner.java:50)
at com.google.gwt.dev.Compiler.main(Compiler.java:127)
:modules:qi-core:vaadinCompile FAILED

FAILURE: Build failed with an exception.

* What went wrong:
Execution failed for task ':modules:qi-core:vaadinCompile'.
> Widgetset failed to compile. See error log.


Am I missing anything??

- Rajesh

--
--
jPOS is licensed under AGPL - free for community usage for your open-source project. Licenses are also available for commercial usage. Please support jPOS, contact: [hidden email]
---
You received this message because you are subscribed to the Google Groups "jPOS Users" group.
To unsubscribe from this group and stop receiving emails from it, send an email to [hidden email].
To post to this group, send email to [hidden email].
To view this discussion on the web visit https://groups.google.com/d/msgid/jpos-users/b0cf51c4-3016-44ec-a55e-9f55e26bb839%40googlegroups.com.
For more options, visit https://groups.google.com/d/optout.

--
--
jPOS is licensed under AGPL - free for community usage for your open-source project. Licenses are also available for commercial usage. Please support jPOS, contact: [hidden email]
---
You received this message because you are subscribed to the Google Groups "jPOS Users" group.
To unsubscribe from this group and stop receiving emails from it, send an email to [hidden email].
To post to this group, send email to [hidden email].
To view this discussion on the web visit https://groups.google.com/d/msgid/jpos-users/CAAgSK%3Dn8jrR6EqZ%3DZNbMGgc5KdjFNjG2Xy%3DkQnH1iWb%2B6C26EA%40mail.gmail.com.
For more options, visit https://groups.google.com/d/optout.
Reply | Threaded
Open this post in threaded view
|

Re: [jpos-users] jposee : gradle install error

Janta Darbar
Hi Alejandro,

Thanks for quick reply.

I tried the same jposee master in my linux laptop. It did not show any error.

I tried to use the gradlew , still get the same error.

-Raj


On Wednesday, April 26, 2017 at 9:17:22 PM UTC-5, Alejandro Revilla wrote:
Anybody else experiencing this problem?

It works for me in OSX and for Travis in Docker/Linux <a href="https://travis-ci.org/jpos/jPOS-EE/builds/225704892" target="_blank" rel="nofollow" onmousedown="this.href=&#39;https://www.google.com/url?q\x3dhttps%3A%2F%2Ftravis-ci.org%2Fjpos%2FjPOS-EE%2Fbuilds%2F225704892\x26sa\x3dD\x26sntz\x3d1\x26usg\x3dAFQjCNHigPw9_FLN1npbj64j9qQnG6XShA&#39;;return true;" onclick="this.href=&#39;https://www.google.com/url?q\x3dhttps%3A%2F%2Ftravis-ci.org%2Fjpos%2FjPOS-EE%2Fbuilds%2F225704892\x26sa\x3dD\x26sntz\x3d1\x26usg\x3dAFQjCNHigPw9_FLN1npbj64j9qQnG6XShA&#39;;return true;">https://travis-ci.org/jpos/jPOS-EE/builds/225704892



--
<a style="font-family:garamond,serif" href="http://twitter.com/apr" target="_blank" rel="nofollow" onmousedown="this.href=&#39;http://www.google.com/url?q\x3dhttp%3A%2F%2Ftwitter.com%2Fapr\x26sa\x3dD\x26sntz\x3d1\x26usg\x3dAFQjCNFRt8creb486OVHOJ12erdzV1NRIg&#39;;return true;" onclick="this.href=&#39;http://www.google.com/url?q\x3dhttp%3A%2F%2Ftwitter.com%2Fapr\x26sa\x3dD\x26sntz\x3d1\x26usg\x3dAFQjCNFRt8creb486OVHOJ12erdzV1NRIg&#39;;return true;">@apr

On Wed, Apr 26, 2017 at 11:08 PM, Janta Darbar <<a href="javascript:" target="_blank" gdf-obfuscated-mailto="KD5_-VoqDAAJ" rel="nofollow" onmousedown="this.href=&#39;javascript:&#39;;return true;" onclick="this.href=&#39;javascript:&#39;;return true;">dilli...@...> wrote:
my laptop is windows 10.

I downloaded the JPosEE Master and tried to Gradle install.

I am using gradle 3.5
java JDK : 1.8.0_121

>gradle install

It is throwing error as follows:

:modules:qi-core:vaadinCompile
Unexpected internal compiler error
java.lang.RuntimeException: Unexpectedly unable to access Enum.createValueOfMap via reflection. Likely a dependency on the com.google.gwt.user.User module is missing.
at com.google.gwt.dev.jjs.impl.GwtAstBuilder$AstVisitor.writeEnumValueOfMethod(GwtAstBuilder.java:2793)
at com.google.gwt.dev.jjs.impl.GwtAstBuilder$AstVisitor.processEnumType(GwtAstBuilder.java:2425)
at com.google.gwt.dev.jjs.impl.GwtAstBuilder$AstVisitor.endVisit(GwtAstBuilder.java:1861)
at com.google.gwt.dev.jjs.impl.GwtAstBuilder$AstVisitor.endVisit(GwtAstBuilder.java:1588)
at org.eclipse.jdt.internal.compiler.ast.TypeDeclaration.traverse(TypeDeclaration.java:1382)
at com.google.gwt.dev.jjs.impl.GwtAstBuilder.process(GwtAstBuilder.java:3058)
at com.google.gwt.dev.javac.CompilationStateBuilder$CompileMoreLater$UnitProcessorImpl.process(CompilationStateBuilder.java:141)
at com.google.gwt.dev.javac.JdtCompiler$CompilerImpl.process(JdtCompiler.java:384)
at org.eclipse.jdt.internal.compiler.Compiler.compile(Compiler.java:470)
at com.google.gwt.dev.javac.JdtCompiler.doCompile(JdtCompiler.java:985)
at com.google.gwt.dev.javac.CompilationStateBuilder$CompileMoreLater.compile(CompilationStateBuilder.java:339)
at com.google.gwt.dev.javac.CompilationStateBuilder.doBuildFrom(CompilationStateBuilder.java:580)
at com.google.gwt.dev.javac.CompilationStateBuilder.buildFrom(CompilationStateBuilder.java:513)
at com.google.gwt.dev.javac.CompilationStateBuilder.buildFrom(CompilationStateBuilder.java:499)
at com.google.gwt.dev.cfg.ModuleDef.getCompilationState(ModuleDef.java:668)
at com.google.gwt.dev.Precompile.precompile(Precompile.java:255)
at com.google.gwt.dev.Precompile.precompile(Precompile.java:229)
at com.google.gwt.dev.Precompile.precompile(Precompile.java:145)
at com.google.gwt.dev.Compiler.run(Compiler.java:206)
at com.google.gwt.dev.Compiler.run(Compiler.java:158)
at com.google.gwt.dev.Compiler$1.run(Compiler.java:120)
at com.google.gwt.dev.CompileTaskRunner.doRun(CompileTaskRunner.java:55)
at com.google.gwt.dev.CompileTaskRunner.runWithAppropriateLogger(CompileTaskRunner.java:50)
at com.google.gwt.dev.Compiler.main(Compiler.java:127)
:modules:qi-core:vaadinCompile FAILED

FAILURE: Build failed with an exception.

* What went wrong:
Execution failed for task ':modules:qi-core:vaadinCompile'.
> Widgetset failed to compile. See error log.


Am I missing anything??

- Rajesh

--
--
jPOS is licensed under AGPL - free for community usage for your open-source project. Licenses are also available for commercial usage. Please support jPOS, contact: <a href="javascript:" target="_blank" gdf-obfuscated-mailto="KD5_-VoqDAAJ" rel="nofollow" onmousedown="this.href=&#39;javascript:&#39;;return true;" onclick="this.href=&#39;javascript:&#39;;return true;">sa...@...
---
You received this message because you are subscribed to the Google Groups "jPOS Users" group.
To unsubscribe from this group and stop receiving emails from it, send an email to <a href="javascript:" target="_blank" gdf-obfuscated-mailto="KD5_-VoqDAAJ" rel="nofollow" onmousedown="this.href=&#39;javascript:&#39;;return true;" onclick="this.href=&#39;javascript:&#39;;return true;">jpos-users+...@googlegroups.com.
To post to this group, send email to <a href="javascript:" target="_blank" gdf-obfuscated-mailto="KD5_-VoqDAAJ" rel="nofollow" onmousedown="this.href=&#39;javascript:&#39;;return true;" onclick="this.href=&#39;javascript:&#39;;return true;">jpos-...@....
To view this discussion on the web visit <a href="https://groups.google.com/d/msgid/jpos-users/b0cf51c4-3016-44ec-a55e-9f55e26bb839%40googlegroups.com?utm_medium=email&amp;utm_source=footer" target="_blank" rel="nofollow" onmousedown="this.href=&#39;https://groups.google.com/d/msgid/jpos-users/b0cf51c4-3016-44ec-a55e-9f55e26bb839%40googlegroups.com?utm_medium\x3demail\x26utm_source\x3dfooter&#39;;return true;" onclick="this.href=&#39;https://groups.google.com/d/msgid/jpos-users/b0cf51c4-3016-44ec-a55e-9f55e26bb839%40googlegroups.com?utm_medium\x3demail\x26utm_source\x3dfooter&#39;;return true;">https://groups.google.com/d/msgid/jpos-users/b0cf51c4-3016-44ec-a55e-9f55e26bb839%40googlegroups.com.
For more options, visit <a href="https://groups.google.com/d/optout" target="_blank" rel="nofollow" onmousedown="this.href=&#39;https://groups.google.com/d/optout&#39;;return true;" onclick="this.href=&#39;https://groups.google.com/d/optout&#39;;return true;">https://groups.google.com/d/optout.

--
--
jPOS is licensed under AGPL - free for community usage for your open-source project. Licenses are also available for commercial usage. Please support jPOS, contact: [hidden email]
---
You received this message because you are subscribed to the Google Groups "jPOS Users" group.
To unsubscribe from this group and stop receiving emails from it, send an email to [hidden email].
To post to this group, send email to [hidden email].
To view this discussion on the web visit https://groups.google.com/d/msgid/jpos-users/8d5a4206-3d4e-45c8-bfbb-9e33c7dfe4e5%40googlegroups.com.
For more options, visit https://groups.google.com/d/optout.
Reply | Threaded
Open this post in threaded view
|

Re: [jpos-users] jposee : gradle install error

Janta Darbar


On Wednesday, April 26, 2017 at 9:22:57 PM UTC-5, Janta Darbar wrote:
Hi Alejandro,

Thanks for quick reply.

I tried the same jposee master in my linux laptop. It did not show any error.

I tried to use the gradlew in my windows laptop, still get the same error.

-Raj


On Wednesday, April 26, 2017 at 9:17:22 PM UTC-5, Alejandro Revilla wrote:
Anybody else experiencing this problem?

It works for me in OSX and for Travis in Docker/Linux <a href="https://travis-ci.org/jpos/jPOS-EE/builds/225704892" rel="nofollow" target="_blank" onmousedown="this.href=&#39;https://www.google.com/url?q\x3dhttps%3A%2F%2Ftravis-ci.org%2Fjpos%2FjPOS-EE%2Fbuilds%2F225704892\x26sa\x3dD\x26sntz\x3d1\x26usg\x3dAFQjCNHigPw9_FLN1npbj64j9qQnG6XShA&#39;;return true;" onclick="this.href=&#39;https://www.google.com/url?q\x3dhttps%3A%2F%2Ftravis-ci.org%2Fjpos%2FjPOS-EE%2Fbuilds%2F225704892\x26sa\x3dD\x26sntz\x3d1\x26usg\x3dAFQjCNHigPw9_FLN1npbj64j9qQnG6XShA&#39;;return true;">https://travis-ci.org/jpos/jPOS-EE/builds/225704892



--
<a style="font-family:garamond,serif" href="http://twitter.com/apr" rel="nofollow" target="_blank" onmousedown="this.href=&#39;http://www.google.com/url?q\x3dhttp%3A%2F%2Ftwitter.com%2Fapr\x26sa\x3dD\x26sntz\x3d1\x26usg\x3dAFQjCNFRt8creb486OVHOJ12erdzV1NRIg&#39;;return true;" onclick="this.href=&#39;http://www.google.com/url?q\x3dhttp%3A%2F%2Ftwitter.com%2Fapr\x26sa\x3dD\x26sntz\x3d1\x26usg\x3dAFQjCNFRt8creb486OVHOJ12erdzV1NRIg&#39;;return true;">@apr

On Wed, Apr 26, 2017 at 11:08 PM, Janta Darbar <[hidden email]> wrote:
my laptop is windows 10.

I downloaded the JPosEE Master and tried to Gradle install.

I am using gradle 3.5
java JDK : 1.8.0_121

>gradle install

It is throwing error as follows:

:modules:qi-core:vaadinCompile
Unexpected internal compiler error
java.lang.RuntimeException: Unexpectedly unable to access Enum.createValueOfMap via reflection. Likely a dependency on the com.google.gwt.user.User module is missing.
at com.google.gwt.dev.jjs.impl.GwtAstBuilder$AstVisitor.writeEnumValueOfMethod(GwtAstBuilder.java:2793)
at com.google.gwt.dev.jjs.impl.GwtAstBuilder$AstVisitor.processEnumType(GwtAstBuilder.java:2425)
at com.google.gwt.dev.jjs.impl.GwtAstBuilder$AstVisitor.endVisit(GwtAstBuilder.java:1861)
at com.google.gwt.dev.jjs.impl.GwtAstBuilder$AstVisitor.endVisit(GwtAstBuilder.java:1588)
at org.eclipse.jdt.internal.compiler.ast.TypeDeclaration.traverse(TypeDeclaration.java:1382)
at com.google.gwt.dev.jjs.impl.GwtAstBuilder.process(GwtAstBuilder.java:3058)
at com.google.gwt.dev.javac.CompilationStateBuilder$CompileMoreLater$UnitProcessorImpl.process(CompilationStateBuilder.java:141)
at com.google.gwt.dev.javac.JdtCompiler$CompilerImpl.process(JdtCompiler.java:384)
at org.eclipse.jdt.internal.compiler.Compiler.compile(Compiler.java:470)
at com.google.gwt.dev.javac.JdtCompiler.doCompile(JdtCompiler.java:985)
at com.google.gwt.dev.javac.CompilationStateBuilder$CompileMoreLater.compile(CompilationStateBuilder.java:339)
at com.google.gwt.dev.javac.CompilationStateBuilder.doBuildFrom(CompilationStateBuilder.java:580)
at com.google.gwt.dev.javac.CompilationStateBuilder.buildFrom(CompilationStateBuilder.java:513)
at com.google.gwt.dev.javac.CompilationStateBuilder.buildFrom(CompilationStateBuilder.java:499)
at com.google.gwt.dev.cfg.ModuleDef.getCompilationState(ModuleDef.java:668)
at com.google.gwt.dev.Precompile.precompile(Precompile.java:255)
at com.google.gwt.dev.Precompile.precompile(Precompile.java:229)
at com.google.gwt.dev.Precompile.precompile(Precompile.java:145)
at com.google.gwt.dev.Compiler.run(Compiler.java:206)
at com.google.gwt.dev.Compiler.run(Compiler.java:158)
at com.google.gwt.dev.Compiler$1.run(Compiler.java:120)
at com.google.gwt.dev.CompileTaskRunner.doRun(CompileTaskRunner.java:55)
at com.google.gwt.dev.CompileTaskRunner.runWithAppropriateLogger(CompileTaskRunner.java:50)
at com.google.gwt.dev.Compiler.main(Compiler.java:127)
:modules:qi-core:vaadinCompile FAILED

FAILURE: Build failed with an exception.

* What went wrong:
Execution failed for task ':modules:qi-core:vaadinCompile'.
> Widgetset failed to compile. See error log.


Am I missing anything??

- Rajesh

--
--
jPOS is licensed under AGPL - free for community usage for your open-source project. Licenses are also available for commercial usage. Please support jPOS, contact: [hidden email]
---
You received this message because you are subscribed to the Google Groups "jPOS Users" group.
To unsubscribe from this group and stop receiving emails from it, send an email to jpos-users+...@googlegroups.com.
To post to this group, send email to [hidden email].
To view this discussion on the web visit <a href="https://groups.google.com/d/msgid/jpos-users/b0cf51c4-3016-44ec-a55e-9f55e26bb839%40googlegroups.com?utm_medium=email&amp;utm_source=footer" rel="nofollow" target="_blank" onmousedown="this.href=&#39;https://groups.google.com/d/msgid/jpos-users/b0cf51c4-3016-44ec-a55e-9f55e26bb839%40googlegroups.com?utm_medium\x3demail\x26utm_source\x3dfooter&#39;;return true;" onclick="this.href=&#39;https://groups.google.com/d/msgid/jpos-users/b0cf51c4-3016-44ec-a55e-9f55e26bb839%40googlegroups.com?utm_medium\x3demail\x26utm_source\x3dfooter&#39;;return true;">https://groups.google.com/d/msgid/jpos-users/b0cf51c4-3016-44ec-a55e-9f55e26bb839%40googlegroups.com.
For more options, visit <a href="https://groups.google.com/d/optout" rel="nofollow" target="_blank" onmousedown="this.href=&#39;https://groups.google.com/d/optout&#39;;return true;" onclick="this.href=&#39;https://groups.google.com/d/optout&#39;;return true;">https://groups.google.com/d/optout.

--
--
jPOS is licensed under AGPL - free for community usage for your open-source project. Licenses are also available for commercial usage. Please support jPOS, contact: [hidden email]
---
You received this message because you are subscribed to the Google Groups "jPOS Users" group.
To unsubscribe from this group and stop receiving emails from it, send an email to [hidden email].
To post to this group, send email to [hidden email].
To view this discussion on the web visit https://groups.google.com/d/msgid/jpos-users/6918d3d0-3df0-4a6b-bbc7-034cee3dac15%40googlegroups.com.
For more options, visit https://groups.google.com/d/optout.
Reply | Threaded
Open this post in threaded view
|

Re: [jpos-users] jposee : gradle install error

Alejandro Revilla
In reply to this post by Janta Darbar
Unfortunately I don't have any Windows box to test.

Hope any Windows user can give it a try and shed some light.


--
--
jPOS is licensed under AGPL - free for community usage for your open-source project. Licenses are also available for commercial usage. Please support jPOS, contact: [hidden email]
---
You received this message because you are subscribed to the Google Groups "jPOS Users" group.
To unsubscribe from this group and stop receiving emails from it, send an email to [hidden email].
To post to this group, send email to [hidden email].
To view this discussion on the web visit https://groups.google.com/d/msgid/jpos-users/CAAgSK%3DkihnjyRa7GithLz%2B9yR5%3D_xFj-Fidd3P%3DLr5--q5GS0A%40mail.gmail.com.
For more options, visit https://groups.google.com/d/optout.
Reply | Threaded
Open this post in threaded view
|

[jpos-users] Re: jposee : gradle install error

Janta Darbar
In reply to this post by Janta Darbar
Can anybody please confirm if they have installed latest JPosEE master in their windows machine?

-Raj



On Wednesday, April 26, 2017 at 9:08:17 PM UTC-5, Janta Darbar wrote:
my laptop is windows 10.

I downloaded the JPosEE Master and tried to Gradle install.

I am using gradle 3.5
java JDK : 1.8.0_121

>gradle install

It is throwing error as follows:

:modules:qi-core:vaadinCompile
Unexpected internal compiler error
java.lang.RuntimeException: Unexpectedly unable to access Enum.createValueOfMap via reflection. Likely a dependency on the com.google.gwt.user.User module is missing.
at com.google.gwt.dev.jjs.impl.GwtAstBuilder$AstVisitor.writeEnumValueOfMethod(GwtAstBuilder.java:2793)
at com.google.gwt.dev.jjs.impl.GwtAstBuilder$AstVisitor.processEnumType(GwtAstBuilder.java:2425)
at com.google.gwt.dev.jjs.impl.GwtAstBuilder$AstVisitor.endVisit(GwtAstBuilder.java:1861)
at com.google.gwt.dev.jjs.impl.GwtAstBuilder$AstVisitor.endVisit(GwtAstBuilder.java:1588)
at org.eclipse.jdt.internal.compiler.ast.TypeDeclaration.traverse(TypeDeclaration.java:1382)
at com.google.gwt.dev.jjs.impl.GwtAstBuilder.process(GwtAstBuilder.java:3058)
at com.google.gwt.dev.javac.CompilationStateBuilder$CompileMoreLater$UnitProcessorImpl.process(CompilationStateBuilder.java:141)
at com.google.gwt.dev.javac.JdtCompiler$CompilerImpl.process(JdtCompiler.java:384)
at org.eclipse.jdt.internal.compiler.Compiler.compile(Compiler.java:470)
at com.google.gwt.dev.javac.JdtCompiler.doCompile(JdtCompiler.java:985)
at com.google.gwt.dev.javac.CompilationStateBuilder$CompileMoreLater.compile(CompilationStateBuilder.java:339)
at com.google.gwt.dev.javac.CompilationStateBuilder.doBuildFrom(CompilationStateBuilder.java:580)
at com.google.gwt.dev.javac.CompilationStateBuilder.buildFrom(CompilationStateBuilder.java:513)
at com.google.gwt.dev.javac.CompilationStateBuilder.buildFrom(CompilationStateBuilder.java:499)
at com.google.gwt.dev.cfg.ModuleDef.getCompilationState(ModuleDef.java:668)
at com.google.gwt.dev.Precompile.precompile(Precompile.java:255)
at com.google.gwt.dev.Precompile.precompile(Precompile.java:229)
at com.google.gwt.dev.Precompile.precompile(Precompile.java:145)
at com.google.gwt.dev.Compiler.run(Compiler.java:206)
at com.google.gwt.dev.Compiler.run(Compiler.java:158)
at com.google.gwt.dev.Compiler$1.run(Compiler.java:120)
at com.google.gwt.dev.CompileTaskRunner.doRun(CompileTaskRunner.java:55)
at com.google.gwt.dev.CompileTaskRunner.runWithAppropriateLogger(CompileTaskRunner.java:50)
at com.google.gwt.dev.Compiler.main(Compiler.java:127)
:modules:qi-core:vaadinCompile FAILED

FAILURE: Build failed with an exception.

* What went wrong:
Execution failed for task ':modules:qi-core:vaadinCompile'.
> Widgetset failed to compile. See error log.


Am I missing anything??

- Rajesh

--
--
jPOS is licensed under AGPL - free for community usage for your open-source project. Licenses are also available for commercial usage. Please support jPOS, contact: [hidden email]
---
You received this message because you are subscribed to the Google Groups "jPOS Users" group.
To unsubscribe from this group and stop receiving emails from it, send an email to [hidden email].
To post to this group, send email to [hidden email].
To view this discussion on the web visit https://groups.google.com/d/msgid/jpos-users/a95efdbd-2c79-4003-bb73-fff7696cc565%40googlegroups.com.
For more options, visit https://groups.google.com/d/optout.
Reply | Threaded
Open this post in threaded view
|

[jpos-users] Re: jposee : gradle install error

adhi nugroho
yes..i have a same problem with that on windows 10 

Unexpected internal compiler error
java
.lang.RuntimeException: Unexpectedly unable to access Enum.createValueOfMap via reflection. Likely a dependency on the com.google.gwt.user.User module is missing.
at com
.google.gwt.dev.jjs.impl.GwtAstBuilder$AstVisitor.writeEnumValueOfMethod(GwtAstBuilder.java:2793)
at com
.google.gwt.dev.jjs.impl.GwtAstBuilder$AstVisitor.processEnumType(GwtAstBuilder.java:2425)
at com
.google.gwt.dev.jjs.impl.GwtAstBuilder$AstVisitor.endVisit(GwtAstBuilder.java:1861)
at com
.google.gwt.dev.jjs.impl.GwtAstBuilder$AstVisitor.endVisit(GwtAstBuilder.java:1588)
at org
.eclipse.jdt.internal.compiler.ast.TypeDeclaration.traverse(TypeDeclaration.java:1382)
at com
.google.gwt.dev.jjs.impl.GwtAstBuilder.process(GwtAstBuilder.java:3058)
at com
.google.gwt.dev.javac.CompilationStateBuilder$CompileMoreLater$UnitProcessorImpl.process(CompilationStateBuilder.java:141)


On Friday, April 28, 2017 at 5:23:58 AM UTC+7, Janta Darbar wrote:
Can anybody please confirm if they have installed latest JPosEE master in their windows machine?

-Raj



On Wednesday, April 26, 2017 at 9:08:17 PM UTC-5, Janta Darbar wrote:
my laptop is windows 10.

I downloaded the JPosEE Master and tried to Gradle install.

I am using gradle 3.5
java JDK : 1.8.0_121

>gradle install

It is throwing error as follows:

:modules:qi-core:vaadinCompile
Unexpected internal compiler error
java.lang.RuntimeException: Unexpectedly unable to access Enum.createValueOfMap via reflection. Likely a dependency on the com.google.gwt.user.User module is missing.
at com.google.gwt.dev.jjs.impl.GwtAstBuilder$AstVisitor.writeEnumValueOfMethod(GwtAstBuilder.java:2793)
at com.google.gwt.dev.jjs.impl.GwtAstBuilder$AstVisitor.processEnumType(GwtAstBuilder.java:2425)
at com.google.gwt.dev.jjs.impl.GwtAstBuilder$AstVisitor.endVisit(GwtAstBuilder.java:1861)
at com.google.gwt.dev.jjs.impl.GwtAstBuilder$AstVisitor.endVisit(GwtAstBuilder.java:1588)
at org.eclipse.jdt.internal.compiler.ast.TypeDeclaration.traverse(TypeDeclaration.java:1382)
at com.google.gwt.dev.jjs.impl.GwtAstBuilder.process(GwtAstBuilder.java:3058)
at com.google.gwt.dev.javac.CompilationStateBuilder$CompileMoreLater$UnitProcessorImpl.process(CompilationStateBuilder.java:141)
at com.google.gwt.dev.javac.JdtCompiler$CompilerImpl.process(JdtCompiler.java:384)
at org.eclipse.jdt.internal.compiler.Compiler.compile(Compiler.java:470)
at com.google.gwt.dev.javac.JdtCompiler.doCompile(JdtCompiler.java:985)
at com.google.gwt.dev.javac.CompilationStateBuilder$CompileMoreLater.compile(CompilationStateBuilder.java:339)
at com.google.gwt.dev.javac.CompilationStateBuilder.doBuildFrom(CompilationStateBuilder.java:580)
at com.google.gwt.dev.javac.CompilationStateBuilder.buildFrom(CompilationStateBuilder.java:513)
at com.google.gwt.dev.javac.CompilationStateBuilder.buildFrom(CompilationStateBuilder.java:499)
at com.google.gwt.dev.cfg.ModuleDef.getCompilationState(ModuleDef.java:668)
at com.google.gwt.dev.Precompile.precompile(Precompile.java:255)
at com.google.gwt.dev.Precompile.precompile(Precompile.java:229)
at com.google.gwt.dev.Precompile.precompile(Precompile.java:145)
at com.google.gwt.dev.Compiler.run(Compiler.java:206)
at com.google.gwt.dev.Compiler.run(Compiler.java:158)
at com.google.gwt.dev.Compiler$1.run(Compiler.java:120)
at com.google.gwt.dev.CompileTaskRunner.doRun(CompileTaskRunner.java:55)
at com.google.gwt.dev.CompileTaskRunner.runWithAppropriateLogger(CompileTaskRunner.java:50)
at com.google.gwt.dev.Compiler.main(Compiler.java:127)
:modules:qi-core:vaadinCompile FAILED

FAILURE: Build failed with an exception.

* What went wrong:
Execution failed for task ':modules:qi-core:vaadinCompile'.
> Widgetset failed to compile. See error log.


Am I missing anything??

- Rajesh

--
--
jPOS is licensed under AGPL - free for community usage for your open-source project. Licenses are also available for commercial usage. Please support jPOS, contact: [hidden email]
---
You received this message because you are subscribed to the Google Groups "jPOS Users" group.
To unsubscribe from this group and stop receiving emails from it, send an email to [hidden email].
To post to this group, send email to [hidden email].
To view this discussion on the web visit https://groups.google.com/d/msgid/jpos-users/3c01d42c-0a03-4dd5-8ed4-bbf4eafcf96d%40googlegroups.com.
For more options, visit https://groups.google.com/d/optout.
Reply | Threaded
Open this post in threaded view
|

Re: [jpos-users] Re: jposee : gradle install error

chhil


unzipped on win10 to C:\Temp\jPOS-EE-master and 

ran gradlew.bat ran gradlew install

got the error as seen by users in the thread.

Then used the same location as a mounted volume in my local docker image jpos/ubuntu_vivid_jdk8_unlimited 

docker run -t -i -v C:\Temp\jPOS-EE-master:/opt/jposee jpos/ubuntu_vivid_jdk8_unlimited

​​
ran ./gradlew ran ./gradlew install

Build generated.

-chhil  

On Fri, Apr 28, 2017 at 5:14 AM, adhi nugroho <[hidden email]> wrote:
yes..i have a same problem with that on windows 10 

Unexpected internal compiler error
java
.lang.RuntimeException: Unexpectedly unable to access Enum.createValueOfMap via reflection. Likely a dependency on the com.google.gwt.user.User module is missing.
at com
.google.gwt.dev.jjs.impl.GwtAstBuilder$AstVisitor.writeEnumValueOfMethod(GwtAstBuilder.java:2793)
at com
.google.gwt.dev.jjs.impl.GwtAstBuilder$AstVisitor.processEnumType(GwtAstBuilder.java:2425)
at com
.google.gwt.dev.jjs.impl.GwtAstBuilder$AstVisitor.endVisit(GwtAstBuilder.java:1861)
at com
.google.gwt.dev.jjs.impl.GwtAstBuilder$AstVisitor.endVisit(GwtAstBuilder.java:1588)
at org
.eclipse.jdt.internal.compiler.ast.TypeDeclaration.traverse(TypeDeclaration.java:1382)
at com
.google.gwt.dev.jjs.impl.GwtAstBuilder.process(GwtAstBuilder.java:3058)
at com
.google.gwt.dev.javac.CompilationStateBuilder$CompileMoreLater$UnitProcessorImpl.process(CompilationStateBuilder.java:141)


On Friday, April 28, 2017 at 5:23:58 AM UTC+7, Janta Darbar wrote:
Can anybody please confirm if they have installed latest JPosEE master in their windows machine?

-Raj



On Wednesday, April 26, 2017 at 9:08:17 PM UTC-5, Janta Darbar wrote:
my laptop is windows 10.

I downloaded the JPosEE Master and tried to Gradle install.

I am using gradle 3.5
java JDK : 1.8.0_121

>gradle install

It is throwing error as follows:

:modules:qi-core:vaadinCompile
Unexpected internal compiler error
java.lang.RuntimeException: Unexpectedly unable to access Enum.createValueOfMap via reflection. Likely a dependency on the com.google.gwt.user.User module is missing.
at com.google.gwt.dev.jjs.impl.GwtAstBuilder$AstVisitor.writeEnumValueOfMethod(GwtAstBuilder.java:2793)
at com.google.gwt.dev.jjs.impl.GwtAstBuilder$AstVisitor.processEnumType(GwtAstBuilder.java:2425)
at com.google.gwt.dev.jjs.impl.GwtAstBuilder$AstVisitor.endVisit(GwtAstBuilder.java:1861)
at com.google.gwt.dev.jjs.impl.GwtAstBuilder$AstVisitor.endVisit(GwtAstBuilder.java:1588)
at org.eclipse.jdt.internal.compiler.ast.TypeDeclaration.traverse(TypeDeclaration.java:1382)
at com.google.gwt.dev.jjs.impl.GwtAstBuilder.process(GwtAstBuilder.java:3058)
at com.google.gwt.dev.javac.CompilationStateBuilder$CompileMoreLater$UnitProcessorImpl.process(CompilationStateBuilder.java:141)
at com.google.gwt.dev.javac.JdtCompiler$CompilerImpl.process(JdtCompiler.java:384)
at org.eclipse.jdt.internal.compiler.Compiler.compile(Compiler.java:470)
at com.google.gwt.dev.javac.JdtCompiler.doCompile(JdtCompiler.java:985)
at com.google.gwt.dev.javac.CompilationStateBuilder$CompileMoreLater.compile(CompilationStateBuilder.java:339)
at com.google.gwt.dev.javac.CompilationStateBuilder.doBuildFrom(CompilationStateBuilder.java:580)
at com.google.gwt.dev.javac.CompilationStateBuilder.buildFrom(CompilationStateBuilder.java:513)
at com.google.gwt.dev.javac.CompilationStateBuilder.buildFrom(CompilationStateBuilder.java:499)
at com.google.gwt.dev.cfg.ModuleDef.getCompilationState(ModuleDef.java:668)
at com.google.gwt.dev.Precompile.precompile(Precompile.java:255)
at com.google.gwt.dev.Precompile.precompile(Precompile.java:229)
at com.google.gwt.dev.Precompile.precompile(Precompile.java:145)
at com.google.gwt.dev.Compiler.run(Compiler.java:206)
at com.google.gwt.dev.Compiler.run(Compiler.java:158)
at com.google.gwt.dev.Compiler$1.run(Compiler.java:120)
at com.google.gwt.dev.CompileTaskRunner.doRun(CompileTaskRunner.java:55)
at com.google.gwt.dev.CompileTaskRunner.runWithAppropriateLogger(CompileTaskRunner.java:50)
at com.google.gwt.dev.Compiler.main(Compiler.java:127)
:modules:qi-core:vaadinCompile FAILED

FAILURE: Build failed with an exception.

* What went wrong:
Execution failed for task ':modules:qi-core:vaadinCompile'.
> Widgetset failed to compile. See error log.


Am I missing anything??

- Rajesh

--
--
jPOS is licensed under AGPL - free for community usage for your open-source project. Licenses are also available for commercial usage. Please support jPOS, contact: [hidden email]
---
You received this message because you are subscribed to the Google Groups "jPOS Users" group.
To unsubscribe from this group and stop receiving emails from it, send an email to [hidden email].
To post to this group, send email to [hidden email].
To view this discussion on the web visit https://groups.google.com/d/msgid/jpos-users/3c01d42c-0a03-4dd5-8ed4-bbf4eafcf96d%40googlegroups.com.

For more options, visit https://groups.google.com/d/optout.

--
--
jPOS is licensed under AGPL - free for community usage for your open-source project. Licenses are also available for commercial usage. Please support jPOS, contact: [hidden email]
---
You received this message because you are subscribed to the Google Groups "jPOS Users" group.
To unsubscribe from this group and stop receiving emails from it, send an email to [hidden email].
To post to this group, send email to [hidden email].
To view this discussion on the web visit https://groups.google.com/d/msgid/jpos-users/CAPazefAjVkfx7qD6iP300UC3fkm_n60aKcznZnVvDd%2B9Zvff%3Dg%40mail.gmail.com.
For more options, visit https://groups.google.com/d/optout.
Reply | Threaded
Open this post in threaded view
|

Re: [jpos-users] jposee : gradle install error

Barzilai Spinak
can anyone do a git bisect and find out which commit introduced the error?

On Friday, April 28, 2017, chhil <[hidden email]> wrote:


unzipped on win10 to C:\Temp\jPOS-EE-master and 

ran gradlew.bat ran gradlew install

got the error as seen by users in the thread.

Then used the same location as a mounted volume in my local docker image jpos/ubuntu_vivid_jdk8_unlimited 

docker run -t -i -v C:\Temp\jPOS-EE-master:/opt/jposee jpos/ubuntu_vivid_jdk8_unlimited

​​
ran ./gradlew ran ./gradlew install

Build generated.

-chhil  

On Fri, Apr 28, 2017 at 5:14 AM, adhi nugroho <<a href="javascript:_e(%7B%7D,&#39;cvml&#39;,&#39;phenom1711@gmail.com&#39;);" target="_blank">phenom1711@...> wrote:
yes..i have a same problem with that on windows 10 

Unexpected internal compiler error
java
.lang.RuntimeException: Unexpectedly unable to access Enum.createValueOfMap via reflection. Likely a dependency on the com.google.gwt.user.User module is missing.
at com
.google.gwt.dev.jjs.impl.GwtAstBuilder$AstVisitor.writeEnumValueOfMethod(GwtAstBuilder.java:2793)
at com
.google.gwt.dev.jjs.impl.GwtAstBuilder$AstVisitor.processEnumType(GwtAstBuilder.java:2425)
at com
.google.gwt.dev.jjs.impl.GwtAstBuilder$AstVisitor.endVisit(GwtAstBuilder.java:1861)
at com
.google.gwt.dev.jjs.impl.GwtAstBuilder$AstVisitor.endVisit(GwtAstBuilder.java:1588)
at org
.eclipse.jdt.internal.compiler.ast.TypeDeclaration.traverse(TypeDeclaration.java:1382)
at com
.google.gwt.dev.jjs.impl.GwtAstBuilder.process(GwtAstBuilder.java:3058)
at com
.google.gwt.dev.javac.CompilationStateBuilder$CompileMoreLater$UnitProcessorImpl.process(CompilationStateBuilder.java:141)


On Friday, April 28, 2017 at 5:23:58 AM UTC+7, Janta Darbar wrote:
Can anybody please confirm if they have installed latest JPosEE master in their windows machine?

-Raj



On Wednesday, April 26, 2017 at 9:08:17 PM UTC-5, Janta Darbar wrote:
my laptop is windows 10.

I downloaded the JPosEE Master and tried to Gradle install.

I am using gradle 3.5
java JDK : 1.8.0_121

>gradle install

It is throwing error as follows:

:modules:qi-core:vaadinCompile
Unexpected internal compiler error
java.lang.RuntimeException: Unexpectedly unable to access Enum.createValueOfMap via reflection. Likely a dependency on the com.google.gwt.user.User module is missing.
at com.google.gwt.dev.jjs.impl.GwtAstBuilder$AstVisitor.writeEnumValueOfMethod(GwtAstBuilder.java:2793)
at com.google.gwt.dev.jjs.impl.GwtAstBuilder$AstVisitor.processEnumType(GwtAstBuilder.java:2425)
at com.google.gwt.dev.jjs.impl.GwtAstBuilder$AstVisitor.endVisit(GwtAstBuilder.java:1861)
at com.google.gwt.dev.jjs.impl.GwtAstBuilder$AstVisitor.endVisit(GwtAstBuilder.java:1588)
at org.eclipse.jdt.internal.compiler.ast.TypeDeclaration.traverse(TypeDeclaration.java:1382)
at com.google.gwt.dev.jjs.impl.GwtAstBuilder.process(GwtAstBuilder.java:3058)
at com.google.gwt.dev.javac.CompilationStateBuilder$CompileMoreLater$UnitProcessorImpl.process(CompilationStateBuilder.java:141)
at com.google.gwt.dev.javac.JdtCompiler$CompilerImpl.process(JdtCompiler.java:384)
at org.eclipse.jdt.internal.compiler.Compiler.compile(Compiler.java:470)
at com.google.gwt.dev.javac.JdtCompiler.doCompile(JdtCompiler.java:985)
at com.google.gwt.dev.javac.CompilationStateBuilder$CompileMoreLater.compile(CompilationStateBuilder.java:339)
at com.google.gwt.dev.javac.CompilationStateBuilder.doBuildFrom(CompilationStateBuilder.java:580)
at com.google.gwt.dev.javac.CompilationStateBuilder.buildFrom(CompilationStateBuilder.java:513)
at com.google.gwt.dev.javac.CompilationStateBuilder.buildFrom(CompilationStateBuilder.java:499)
at com.google.gwt.dev.cfg.ModuleDef.getCompilationState(ModuleDef.java:668)
at com.google.gwt.dev.Precompile.precompile(Precompile.java:255)
at com.google.gwt.dev.Precompile.precompile(Precompile.java:229)
at com.google.gwt.dev.Precompile.precompile(Precompile.java:145)
at com.google.gwt.dev.Compiler.run(Compiler.java:206)
at com.google.gwt.dev.Compiler.run(Compiler.java:158)
at com.google.gwt.dev.Compiler$1.run(Compiler.java:120)
at com.google.gwt.dev.CompileTaskRunner.doRun(CompileTaskRunner.java:55)
at com.google.gwt.dev.CompileTaskRunner.runWithAppropriateLogger(CompileTaskRunner.java:50)
at com.google.gwt.dev.Compiler.main(Compiler.java:127)
:modules:qi-core:vaadinCompile FAILED

FAILURE: Build failed with an exception.

* What went wrong:
Execution failed for task ':modules:qi-core:vaadinCompile'.
> Widgetset failed to compile. See error log.


Am I missing anything??

- Rajesh

--
--
jPOS is licensed under AGPL - free for community usage for your open-source project. Licenses are also available for commercial usage. Please support jPOS, contact: <a href="javascript:_e(%7B%7D,&#39;cvml&#39;,&#39;sales@jpos.org&#39;);" target="_blank">sales@...
---
You received this message because you are subscribed to the Google Groups "jPOS Users" group.
To unsubscribe from this group and stop receiving emails from it, send an email to <a href="javascript:_e(%7B%7D,&#39;cvml&#39;,&#39;jpos-users%2Bunsubscribe@googlegroups.com&#39;);" target="_blank">jpos-users+unsubscribe@googlegroups.com.
To post to this group, send email to <a href="javascript:_e(%7B%7D,&#39;cvml&#39;,&#39;jpos-users@googlegroups.com&#39;);" target="_blank">jpos-users@....
To view this discussion on the web visit https://groups.google.com/d/msgid/jpos-users/3c01d42c-0a03-4dd5-8ed4-bbf4eafcf96d%40googlegroups.com.

For more options, visit https://groups.google.com/d/optout.

--
--
jPOS is licensed under AGPL - free for community usage for your open-source project. Licenses are also available for commercial usage. Please support jPOS, contact: <a href="javascript:_e(%7B%7D,&#39;cvml&#39;,&#39;sales@jpos.org&#39;);" target="_blank">sales@...
---
You received this message because you are subscribed to the Google Groups "jPOS Users" group.
To unsubscribe from this group and stop receiving emails from it, send an email to <a href="javascript:_e(%7B%7D,&#39;cvml&#39;,&#39;jpos-users%2Bunsubscribe@googlegroups.com&#39;);" target="_blank">jpos-users+unsubscribe@googlegroups.com.
To post to this group, send email to <a href="javascript:_e(%7B%7D,&#39;cvml&#39;,&#39;jpos-users@googlegroups.com&#39;);" target="_blank">jpos-users@....
To view this discussion on the web visit https://groups.google.com/d/msgid/jpos-users/CAPazefAjVkfx7qD6iP300UC3fkm_n60aKcznZnVvDd%2B9Zvff%3Dg%40mail.gmail.com.
For more options, visit https://groups.google.com/d/optout.


--
Barzilai Spinak
Transactility, Inc.
www.transactility.com
"Commercial licensing and support for the jPOS.org project"

--
--
jPOS is licensed under AGPL - free for community usage for your open-source project. Licenses are also available for commercial usage. Please support jPOS, contact: [hidden email]
---
You received this message because you are subscribed to the Google Groups "jPOS Users" group.
To unsubscribe from this group and stop receiving emails from it, send an email to [hidden email].
To post to this group, send email to [hidden email].
To view this discussion on the web visit https://groups.google.com/d/msgid/jpos-users/CAMUbAtzBtWE%2BEDYSYrwDc6UefkhSF3BePP04HLZbvhROU%2BcErQ%40mail.gmail.com.
For more options, visit https://groups.google.com/d/optout.
Reply | Threaded
Open this post in threaded view
|

Re: [jpos-users] jposee : gradle install error

chhil

I reached Sep 24 2016

​(sha 
6dba6c83c867b207123b28a052d53fe6188ae934
​)​

and could not build

​ (on Win10 Java 8)​
, though the build error was

Unexpected internal compiler error
java.lang.IncompatibleClassChangeError: class com.google.gwt.dev.javac.asm.CollectMethodData has interface org.objectweb.asm.MethodVisitor as super class
at java.lang.ClassLoader.defineClass1(Native Method)
at java.lang.ClassLoader.defineClass(ClassLoader.java:760)
at java.security.SecureClassLoader.defineClass(SecureClassLoader.java:142)
at java.net.URLClassLoader.defineClass(URLClassLoader.java:467)
at java.net.URLClassLoader.access$100(URLClassLoader.java:73)
...
...
:modules:qi-core:vaadinCompile FAILED
-chhil​





On Sat, Apr 29, 2017 at 10:03 AM, Barzilai Spinak <[hidden email]> wrote:
can anyone do a git bisect and find out which commit introduced the error?


On Friday, April 28, 2017, chhil <[hidden email]> wrote:


unzipped on win10 to C:\Temp\jPOS-EE-master and 

ran gradlew.bat ran gradlew install

got the error as seen by users in the thread.

Then used the same location as a mounted volume in my local docker image jpos/ubuntu_vivid_jdk8_unlimited 

docker run -t -i -v C:\Temp\jPOS-EE-master:/opt/jposee jpos/ubuntu_vivid_jdk8_unlimited

​​
ran ./gradlew ran ./gradlew install

Build generated.

-chhil  

On Fri, Apr 28, 2017 at 5:14 AM, adhi nugroho <[hidden email]> wrote:
yes..i have a same problem with that on windows 10 

Unexpected internal compiler error
java
.lang.RuntimeException: Unexpectedly unable to access Enum.createValueOfMap via reflection. Likely a dependency on the com.google.gwt.user.User module is missing.
at com
.google.gwt.dev.jjs.impl.GwtAstBuilder$AstVisitor.writeEnumValueOfMethod(GwtAstBuilder.java:2793)
at com
.google.gwt.dev.jjs.impl.GwtAstBuilder$AstVisitor.processEnumType(GwtAstBuilder.java:2425)
at com
.google.gwt.dev.jjs.impl.GwtAstBuilder$AstVisitor.endVisit(GwtAstBuilder.java:1861)
at com
.google.gwt.dev.jjs.impl.GwtAstBuilder$AstVisitor.endVisit(GwtAstBuilder.java:1588)
at org
.eclipse.jdt.internal.compiler.ast.TypeDeclaration.traverse(TypeDeclaration.java:1382)
at com
.google.gwt.dev.jjs.impl.GwtAstBuilder.process(GwtAstBuilder.java:3058)
at com
.google.gwt.dev.javac.CompilationStateBuilder$CompileMoreLater$UnitProcessorImpl.process(CompilationStateBuilder.java:141)


On Friday, April 28, 2017 at 5:23:58 AM UTC+7, Janta Darbar wrote:
Can anybody please confirm if they have installed latest JPosEE master in their windows machine?

-Raj



On Wednesday, April 26, 2017 at 9:08:17 PM UTC-5, Janta Darbar wrote:
my laptop is windows 10.

I downloaded the JPosEE Master and tried to Gradle install.

I am using gradle 3.5
java JDK : 1.8.0_121

>gradle install

It is throwing error as follows:

:modules:qi-core:vaadinCompile
Unexpected internal compiler error
java.lang.RuntimeException: Unexpectedly unable to access Enum.createValueOfMap via reflection. Likely a dependency on the com.google.gwt.user.User module is missing.
at com.google.gwt.dev.jjs.impl.GwtAstBuilder$AstVisitor.writeEnumValueOfMethod(GwtAstBuilder.java:2793)
at com.google.gwt.dev.jjs.impl.GwtAstBuilder$AstVisitor.processEnumType(GwtAstBuilder.java:2425)
at com.google.gwt.dev.jjs.impl.GwtAstBuilder$AstVisitor.endVisit(GwtAstBuilder.java:1861)
at com.google.gwt.dev.jjs.impl.GwtAstBuilder$AstVisitor.endVisit(GwtAstBuilder.java:1588)
at org.eclipse.jdt.internal.compiler.ast.TypeDeclaration.traverse(TypeDeclaration.java:1382)
at com.google.gwt.dev.jjs.impl.GwtAstBuilder.process(GwtAstBuilder.java:3058)
at com.google.gwt.dev.javac.CompilationStateBuilder$CompileMoreLater$UnitProcessorImpl.process(CompilationStateBuilder.java:141)
at com.google.gwt.dev.javac.JdtCompiler$CompilerImpl.process(JdtCompiler.java:384)
at org.eclipse.jdt.internal.compiler.Compiler.compile(Compiler.java:470)
at com.google.gwt.dev.javac.JdtCompiler.doCompile(JdtCompiler.java:985)
at com.google.gwt.dev.javac.CompilationStateBuilder$CompileMoreLater.compile(CompilationStateBuilder.java:339)
at com.google.gwt.dev.javac.CompilationStateBuilder.doBuildFrom(CompilationStateBuilder.java:580)
at com.google.gwt.dev.javac.CompilationStateBuilder.buildFrom(CompilationStateBuilder.java:513)
at com.google.gwt.dev.javac.CompilationStateBuilder.buildFrom(CompilationStateBuilder.java:499)
at com.google.gwt.dev.cfg.ModuleDef.getCompilationState(ModuleDef.java:668)
at com.google.gwt.dev.Precompile.precompile(Precompile.java:255)
at com.google.gwt.dev.Precompile.precompile(Precompile.java:229)
at com.google.gwt.dev.Precompile.precompile(Precompile.java:145)
at com.google.gwt.dev.Compiler.run(Compiler.java:206)
at com.google.gwt.dev.Compiler.run(Compiler.java:158)
at com.google.gwt.dev.Compiler$1.run(Compiler.java:120)
at com.google.gwt.dev.CompileTaskRunner.doRun(CompileTaskRunner.java:55)
at com.google.gwt.dev.CompileTaskRunner.runWithAppropriateLogger(CompileTaskRunner.java:50)
at com.google.gwt.dev.Compiler.main(Compiler.java:127)
:modules:qi-core:vaadinCompile FAILED

FAILURE: Build failed with an exception.

* What went wrong:
Execution failed for task ':modules:qi-core:vaadinCompile'.
> Widgetset failed to compile. See error log.


Am I missing anything??

- Rajesh

--
--
jPOS is licensed under AGPL - free for community usage for your open-source project. Licenses are also available for commercial usage. Please support jPOS, contact: [hidden email]
---
You received this message because you are subscribed to the Google Groups "jPOS Users" group.
To unsubscribe from this group and stop receiving emails from it, send an email to jpos-users+unsubscribe@googlegroups.com.
To post to this group, send email to [hidden email].
To view this discussion on the web visit https://groups.google.com/d/msgid/jpos-users/3c01d42c-0a03-4dd5-8ed4-bbf4eafcf96d%40googlegroups.com.

For more options, visit https://groups.google.com/d/optout.

--
--
jPOS is licensed under AGPL - free for community usage for your open-source project. Licenses are also available for commercial usage. Please support jPOS, contact: [hidden email]
---
You received this message because you are subscribed to the Google Groups "jPOS Users" group.
To unsubscribe from this group and stop receiving emails from it, send an email to jpos-users+unsubscribe@googlegroups.com.
To post to this group, send email to [hidden email].
To view this discussion on the web visit https://groups.google.com/d/msgid/jpos-users/CAPazefAjVkfx7qD6iP300UC3fkm_n60aKcznZnVvDd%2B9Zvff%3Dg%40mail.gmail.com.
For more options, visit https://groups.google.com/d/optout.


--
Barzilai Spinak
Transactility, Inc.
www.transactility.com
"Commercial licensing and support for the jPOS.org project"

--
--
jPOS is licensed under AGPL - free for community usage for your open-source project. Licenses are also available for commercial usage. Please support jPOS, contact: [hidden email]
---
You received this message because you are subscribed to the Google Groups "jPOS Users" group.
To unsubscribe from this group and stop receiving emails from it, send an email to [hidden email].
To post to this group, send email to [hidden email].
To view this discussion on the web visit https://groups.google.com/d/msgid/jpos-users/CAMUbAtzBtWE%2BEDYSYrwDc6UefkhSF3BePP04HLZbvhROU%2BcErQ%40mail.gmail.com.

For more options, visit https://groups.google.com/d/optout.

--
--
jPOS is licensed under AGPL - free for community usage for your open-source project. Licenses are also available for commercial usage. Please support jPOS, contact: [hidden email]
---
You received this message because you are subscribed to the Google Groups "jPOS Users" group.
To unsubscribe from this group and stop receiving emails from it, send an email to [hidden email].
To post to this group, send email to [hidden email].
To view this discussion on the web visit https://groups.google.com/d/msgid/jpos-users/CAPazefAHiuwGmsiEH1ROK6KQFNiC%3DobS7NpPmespY8rArwfM0A%40mail.gmail.com.
For more options, visit https://groups.google.com/d/optout.
Reply | Threaded
Open this post in threaded view
|

Re: [jpos-users] jposee : gradle install error

Alejandro Revilla
Dave was kind enough to provide a fix for the BinLog issue and it now builds OK in Windows (https://github.com/jpos/jPOS/pull/128).

The GWT issue doesn't show up in Jenkins/Windows so it must be something else.




On Sat, Apr 29, 2017 at 2:11 AM, chhil <[hidden email]> wrote:

I reached Sep 24 2016

​(sha 
6dba6c83c867b207123b28a052d53fe6188ae934
​)​

and could not build

​ (on Win10 Java 8)​
, though the build error was

Unexpected internal compiler error
java.lang.IncompatibleClassChangeError: class com.google.gwt.dev.javac.asm.CollectMethodData has interface org.objectweb.asm.MethodVisitor as super class
at java.lang.ClassLoader.defineClass1(Native Method)
at java.lang.ClassLoader.defineClass(ClassLoader.java:760)
at java.security.SecureClassLoader.defineClass(SecureClassLoader.java:142)
at java.net.URLClassLoader.defineClass(URLClassLoader.java:467)
at java.net.URLClassLoader.access$100(URLClassLoader.java:73)
...
...
:modules:qi-core:vaadinCompile FAILED
-chhil​





On Sat, Apr 29, 2017 at 10:03 AM, Barzilai Spinak <[hidden email]> wrote:
can anyone do a git bisect and find out which commit introduced the error?


On Friday, April 28, 2017, chhil <[hidden email]> wrote:


unzipped on win10 to C:\Temp\jPOS-EE-master and 

ran gradlew.bat ran gradlew install

got the error as seen by users in the thread.

Then used the same location as a mounted volume in my local docker image jpos/ubuntu_vivid_jdk8_unlimited 

docker run -t -i -v C:\Temp\jPOS-EE-master:/opt/jposee jpos/ubuntu_vivid_jdk8_unlimited

​​
ran ./gradlew ran ./gradlew install

Build generated.

-chhil  

On Fri, Apr 28, 2017 at 5:14 AM, adhi nugroho <[hidden email]> wrote:
yes..i have a same problem with that on windows 10 

Unexpected internal compiler error
java
.lang.RuntimeException: Unexpectedly unable to access Enum.createValueOfMap via reflection. Likely a dependency on the com.google.gwt.user.User module is missing.
at com
.google.gwt.dev.jjs.impl.GwtAstBuilder$AstVisitor.writeEnumValueOfMethod(GwtAstBuilder.java:2793)
at com
.google.gwt.dev.jjs.impl.GwtAstBuilder$AstVisitor.processEnumType(GwtAstBuilder.java:2425)
at com
.google.gwt.dev.jjs.impl.GwtAstBuilder$AstVisitor.endVisit(GwtAstBuilder.java:1861)
at com
.google.gwt.dev.jjs.impl.GwtAstBuilder$AstVisitor.endVisit(GwtAstBuilder.java:1588)
at org
.eclipse.jdt.internal.compiler.ast.TypeDeclaration.traverse(TypeDeclaration.java:1382)
at com
.google.gwt.dev.jjs.impl.GwtAstBuilder.process(GwtAstBuilder.java:3058)
at com
.google.gwt.dev.javac.CompilationStateBuilder$CompileMoreLater$UnitProcessorImpl.process(CompilationStateBuilder.java:141)


On Friday, April 28, 2017 at 5:23:58 AM UTC+7, Janta Darbar wrote:
Can anybody please confirm if they have installed latest JPosEE master in their windows machine?

-Raj



On Wednesday, April 26, 2017 at 9:08:17 PM UTC-5, Janta Darbar wrote:
my laptop is windows 10.

I downloaded the JPosEE Master and tried to Gradle install.

I am using gradle 3.5
java JDK : 1.8.0_121

>gradle install

It is throwing error as follows:

:modules:qi-core:vaadinCompile
Unexpected internal compiler error
java.lang.RuntimeException: Unexpectedly unable to access Enum.createValueOfMap via reflection. Likely a dependency on the com.google.gwt.user.User module is missing.
at com.google.gwt.dev.jjs.impl.GwtAstBuilder$AstVisitor.writeEnumValueOfMethod(GwtAstBuilder.java:2793)
at com.google.gwt.dev.jjs.impl.GwtAstBuilder$AstVisitor.processEnumType(GwtAstBuilder.java:2425)
at com.google.gwt.dev.jjs.impl.GwtAstBuilder$AstVisitor.endVisit(GwtAstBuilder.java:1861)
at com.google.gwt.dev.jjs.impl.GwtAstBuilder$AstVisitor.endVisit(GwtAstBuilder.java:1588)
at org.eclipse.jdt.internal.compiler.ast.TypeDeclaration.traverse(TypeDeclaration.java:1382)
at com.google.gwt.dev.jjs.impl.GwtAstBuilder.process(GwtAstBuilder.java:3058)
at com.google.gwt.dev.javac.CompilationStateBuilder$CompileMoreLater$UnitProcessorImpl.process(CompilationStateBuilder.java:141)
at com.google.gwt.dev.javac.JdtCompiler$CompilerImpl.process(JdtCompiler.java:384)
at org.eclipse.jdt.internal.compiler.Compiler.compile(Compiler.java:470)
at com.google.gwt.dev.javac.JdtCompiler.doCompile(JdtCompiler.java:985)
at com.google.gwt.dev.javac.CompilationStateBuilder$CompileMoreLater.compile(CompilationStateBuilder.java:339)
at com.google.gwt.dev.javac.CompilationStateBuilder.doBuildFrom(CompilationStateBuilder.java:580)
at com.google.gwt.dev.javac.CompilationStateBuilder.buildFrom(CompilationStateBuilder.java:513)
at com.google.gwt.dev.javac.CompilationStateBuilder.buildFrom(CompilationStateBuilder.java:499)
at com.google.gwt.dev.cfg.ModuleDef.getCompilationState(ModuleDef.java:668)
at com.google.gwt.dev.Precompile.precompile(Precompile.java:255)
at com.google.gwt.dev.Precompile.precompile(Precompile.java:229)
at com.google.gwt.dev.Precompile.precompile(Precompile.java:145)
at com.google.gwt.dev.Compiler.run(Compiler.java:206)
at com.google.gwt.dev.Compiler.run(Compiler.java:158)
at com.google.gwt.dev.Compiler$1.run(Compiler.java:120)
at com.google.gwt.dev.CompileTaskRunner.doRun(CompileTaskRunner.java:55)
at com.google.gwt.dev.CompileTaskRunner.runWithAppropriateLogger(CompileTaskRunner.java:50)
at com.google.gwt.dev.Compiler.main(Compiler.java:127)
:modules:qi-core:vaadinCompile FAILED

FAILURE: Build failed with an exception.

* What went wrong:
Execution failed for task ':modules:qi-core:vaadinCompile'.
> Widgetset failed to compile. See error log.


Am I missing anything??

- Rajesh

--
--
jPOS is licensed under AGPL - free for community usage for your open-source project. Licenses are also available for commercial usage. Please support jPOS, contact: [hidden email]
---
You received this message because you are subscribed to the Google Groups "jPOS Users" group.
To unsubscribe from this group and stop receiving emails from it, send an email to jpos-users+unsubscribe@googlegroups.com.
To post to this group, send email to [hidden email].
To view this discussion on the web visit https://groups.google.com/d/msgid/jpos-users/3c01d42c-0a03-4dd5-8ed4-bbf4eafcf96d%40googlegroups.com.

For more options, visit https://groups.google.com/d/optout.

--
--
jPOS is licensed under AGPL - free for community usage for your open-source project. Licenses are also available for commercial usage. Please support jPOS, contact: [hidden email]
---
You received this message because you are subscribed to the Google Groups "jPOS Users" group.
To unsubscribe from this group and stop receiving emails from it, send an email to jpos-users+unsubscribe@googlegroups.com.
To post to this group, send email to [hidden email].
To view this discussion on the web visit https://groups.google.com/d/msgid/jpos-users/CAPazefAjVkfx7qD6iP300UC3fkm_n60aKcznZnVvDd%2B9Zvff%3Dg%40mail.gmail.com.
For more options, visit https://groups.google.com/d/optout.


--
Barzilai Spinak
Transactility, Inc.
www.transactility.com
"Commercial licensing and support for the jPOS.org project"

--
--
jPOS is licensed under AGPL - free for community usage for your open-source project. Licenses are also available for commercial usage. Please support jPOS, contact: [hidden email]
---
You received this message because you are subscribed to the Google Groups "jPOS Users" group.
To unsubscribe from this group and stop receiving emails from it, send an email to [hidden email].
To post to this group, send email to [hidden email].
To view this discussion on the web visit https://groups.google.com/d/msgid/jpos-users/CAMUbAtzBtWE%2BEDYSYrwDc6UefkhSF3BePP04HLZbvhROU%2BcErQ%40mail.gmail.com.

For more options, visit https://groups.google.com/d/optout.

--
--
jPOS is licensed under AGPL - free for community usage for your open-source project. Licenses are also available for commercial usage. Please support jPOS, contact: [hidden email]
---
You received this message because you are subscribed to the Google Groups "jPOS Users" group.
To unsubscribe from this group and stop receiving emails from it, send an email to [hidden email].
To post to this group, send email to [hidden email].
To view this discussion on the web visit https://groups.google.com/d/msgid/jpos-users/CAPazefAHiuwGmsiEH1ROK6KQFNiC%3DobS7NpPmespY8rArwfM0A%40mail.gmail.com.

For more options, visit https://groups.google.com/d/optout.

--
--
jPOS is licensed under AGPL - free for community usage for your open-source project. Licenses are also available for commercial usage. Please support jPOS, contact: [hidden email]
---
You received this message because you are subscribed to the Google Groups "jPOS Users" group.
To unsubscribe from this group and stop receiving emails from it, send an email to [hidden email].
To post to this group, send email to [hidden email].
To view this discussion on the web visit https://groups.google.com/d/msgid/jpos-users/CAAgSK%3DmdhRpv1X4Op0Lh8%3DS0u6anwF19wWhzeLbr5xSe-eaLyw%40mail.gmail.com.
For more options, visit https://groups.google.com/d/optout.
Reply | Threaded
Open this post in threaded view
|

Re: [jpos-users] jposee : gradle install error

Janta Darbar
I changed the boolean values to "true"  in following lines in "modules\qi-core\build.gradle"  file : 

manageDependencies = true
vaadinCompile.gwtSdkFirstInClasspath=true

Now, the jposee 'gradle build'  in Windows environment is successful.

Kind regards,
Raj


On Tuesday, May 2, 2017 at 2:40:34 PM UTC-5, Alejandro Revilla wrote:
Dave was kind enough to provide a fix for the BinLog issue and it now builds OK in Windows (<a href="https://github.com/jpos/jPOS/pull/128" target="_blank" rel="nofollow" onmousedown="this.href=&#39;https://www.google.com/url?q\x3dhttps%3A%2F%2Fgithub.com%2Fjpos%2FjPOS%2Fpull%2F128\x26sa\x3dD\x26sntz\x3d1\x26usg\x3dAFQjCNGpjYmL4HnGV6519l1BWO9gIpWVOw&#39;;return true;" onclick="this.href=&#39;https://www.google.com/url?q\x3dhttps%3A%2F%2Fgithub.com%2Fjpos%2FjPOS%2Fpull%2F128\x26sa\x3dD\x26sntz\x3d1\x26usg\x3dAFQjCNGpjYmL4HnGV6519l1BWO9gIpWVOw&#39;;return true;">https://github.com/jpos/jPOS/pull/128).

The GWT issue doesn't show up in Jenkins/Windows so it must be something else.



--
<a style="font-family:garamond,serif" href="http://twitter.com/apr" target="_blank" rel="nofollow" onmousedown="this.href=&#39;http://www.google.com/url?q\x3dhttp%3A%2F%2Ftwitter.com%2Fapr\x26sa\x3dD\x26sntz\x3d1\x26usg\x3dAFQjCNFRt8creb486OVHOJ12erdzV1NRIg&#39;;return true;" onclick="this.href=&#39;http://www.google.com/url?q\x3dhttp%3A%2F%2Ftwitter.com%2Fapr\x26sa\x3dD\x26sntz\x3d1\x26usg\x3dAFQjCNFRt8creb486OVHOJ12erdzV1NRIg&#39;;return true;">@apr

On Sat, Apr 29, 2017 at 2:11 AM, chhil <<a href="javascript:" target="_blank" gdf-obfuscated-mailto="0ML7FVAfAAAJ" rel="nofollow" onmousedown="this.href=&#39;javascript:&#39;;return true;" onclick="this.href=&#39;javascript:&#39;;return true;">chi...@...> wrote:
I tried getting various zips for build till <a href="https://github.com/jpos/jPOS-EE/tree/6dba6c83c867b207123b28a052d53fe6188ae934" target="_blank" rel="nofollow" onmousedown="this.href=&#39;https://www.google.com/url?q\x3dhttps%3A%2F%2Fgithub.com%2Fjpos%2FjPOS-EE%2Ftree%2F6dba6c83c867b207123b28a052d53fe6188ae934\x26sa\x3dD\x26sntz\x3d1\x26usg\x3dAFQjCNFTXyZrCxDBexkGhdoxgV1p5yP0hw&#39;;return true;" onclick="this.href=&#39;https://www.google.com/url?q\x3dhttps%3A%2F%2Fgithub.com%2Fjpos%2FjPOS-EE%2Ftree%2F6dba6c83c867b207123b28a052d53fe6188ae934\x26sa\x3dD\x26sntz\x3d1\x26usg\x3dAFQjCNFTXyZrCxDBexkGhdoxgV1p5yP0hw&#39;;return true;">https://github.com/jpos/jPOS-EE/tree/6dba6c83c867b207123b28a052d53fe6188ae934

I reached Sep 24 2016

​(sha 
6dba6c83c867b207123b28a052d53fe6188ae934
​)​

and could not build

​ (on Win10 Java 8)​
, though the build error was

Unexpected internal compiler error
java.lang.IncompatibleClassChangeError: class com.google.gwt.dev.javac.asm.CollectMethodData has interface org.objectweb.asm.MethodVisitor as super class
at java.lang.ClassLoader.defineClass1(Native Method)
at java.lang.ClassLoader.defineClass(ClassLoader.java:760)
at java.security.SecureClassLoader.defineClass(SecureClassLoader.java:142)
at java.net.URLClassLoader.defineClass(URLClassLoader.java:467)
at java.net.URLClassLoader.access$100(URLClassLoader.java:73)
...
...
:modules:qi-core:vaadinCompile FAILED
-chhil​





On Sat, Apr 29, 2017 at 10:03 AM, Barzilai Spinak <<a href="javascript:" target="_blank" gdf-obfuscated-mailto="0ML7FVAfAAAJ" rel="nofollow" onmousedown="this.href=&#39;javascript:&#39;;return true;" onclick="this.href=&#39;javascript:&#39;;return true;">bar...@...> wrote:
can anyone do a git bisect and find out which commit introduced the error?


On Friday, April 28, 2017, chhil <<a href="javascript:" target="_blank" gdf-obfuscated-mailto="0ML7FVAfAAAJ" rel="nofollow" onmousedown="this.href=&#39;javascript:&#39;;return true;" onclick="this.href=&#39;javascript:&#39;;return true;">chi...@...> wrote:

Got the zip via <a href="https://github.com/jpos/jPOS-EE/archive/master.zip" target="_blank" rel="nofollow" onmousedown="this.href=&#39;https://www.google.com/url?q\x3dhttps%3A%2F%2Fgithub.com%2Fjpos%2FjPOS-EE%2Farchive%2Fmaster.zip\x26sa\x3dD\x26sntz\x3d1\x26usg\x3dAFQjCNFSTIIJ3X5bIqb_PSkmk6HaZphGIQ&#39;;return true;" onclick="this.href=&#39;https://www.google.com/url?q\x3dhttps%3A%2F%2Fgithub.com%2Fjpos%2FjPOS-EE%2Farchive%2Fmaster.zip\x26sa\x3dD\x26sntz\x3d1\x26usg\x3dAFQjCNFSTIIJ3X5bIqb_PSkmk6HaZphGIQ&#39;;return true;">https://github.com/jpos/jPOS-EE/archive/master.zip

unzipped on win10 to C:\Temp\jPOS-EE-master and 

ran gradlew.bat ran gradlew install

got the error as seen by users in the thread.

Then used the same location as a mounted volume in my local docker image jpos/ubuntu_vivid_jdk8_unlimited 

docker run -t -i -v C:\Temp\jPOS-EE-master:/opt/jposee jpos/ubuntu_vivid_jdk8_unlimited

​​
ran ./gradlew ran ./gradlew install

Build generated.

-chhil  

On Fri, Apr 28, 2017 at 5:14 AM, adhi nugroho <[hidden email]> wrote:
yes..i have a same problem with that on windows 10 

Unexpected internal compiler error
java
.lang.RuntimeException: Unexpectedly unable to access Enum.createValueOfMap via reflection. Likely a dependency on the com.google.gwt.user.User module is missing.
at com
.google.gwt.dev.jjs.impl.GwtAstBuilder$AstVisitor.writeEnumValueOfMethod(GwtAstBuilder.java:2793)
at com
.google.gwt.dev.jjs.impl.GwtAstBuilder$AstVisitor.processEnumType(GwtAstBuilder.java:2425)
at com
.google.gwt.dev.jjs.impl.GwtAstBuilder$AstVisitor.endVisit(GwtAstBuilder.java:1861)
at com
.google.gwt.dev.jjs.impl.GwtAstBuilder$AstVisitor.endVisit(GwtAstBuilder.java:1588)
at org
.eclipse.jdt.internal.compiler.ast.TypeDeclaration.traverse(TypeDeclaration.java:1382)
at com
.google.gwt.dev.jjs.impl.GwtAstBuilder.process(GwtAstBuilder.java:3058)
at com
.google.gwt.dev.javac.CompilationStateBuilder$CompileMoreLater$UnitProcessorImpl.process(CompilationStateBuilder.java:141)


On Friday, April 28, 2017 at 5:23:58 AM UTC+7, Janta Darbar wrote:
Can anybody please confirm if they have installed latest JPosEE master in their windows machine?

-Raj



On Wednesday, April 26, 2017 at 9:08:17 PM UTC-5, Janta Darbar wrote:
my laptop is windows 10.

I downloaded the JPosEE Master and tried to Gradle install.

I am using gradle 3.5
java JDK : 1.8.0_121

>gradle install

It is throwing error as follows:

:modules:qi-core:vaadinCompile
Unexpected internal compiler error
java.lang.RuntimeException: Unexpectedly unable to access Enum.createValueOfMap via reflection. Likely a dependency on the com.google.gwt.user.User module is missing.
at <a href="http://com.google.gwt.dev.jjs.impl.Gw" target="_blank" rel="nofollow" onmousedown="this.href=&#39;http://www.google.com/url?q\x3dhttp%3A%2F%2Fcom.google.gwt.dev.jjs.impl.Gw\x26sa\x3dD\x26sntz\x3d1\x26usg\x3dAFQjCNGvRJR19AQt0TfIqvq7txcCEfSF0g&#39;;return true;" onclick="this.href=&#39;http://www.google.com/url?q\x3dhttp%3A%2F%2Fcom.google.gwt.dev.jjs.impl.Gw\x26sa\x3dD\x26sntz\x3d1\x26usg\x3dAFQjCNGvRJR19AQt0TfIqvq7txcCEfSF0g&#39;;return true;">com.google.gwt.dev.jjs.impl.GwtAstBuilder$AstVisitor.writeEnumValueOfMethod(GwtAstBuilder.java:2793)
at <a href="http://com.google.gwt.dev.jjs.impl.Gw" target="_blank" rel="nofollow" onmousedown="this.href=&#39;http://www.google.com/url?q\x3dhttp%3A%2F%2Fcom.google.gwt.dev.jjs.impl.Gw\x26sa\x3dD\x26sntz\x3d1\x26usg\x3dAFQjCNGvRJR19AQt0TfIqvq7txcCEfSF0g&#39;;return true;" onclick="this.href=&#39;http://www.google.com/url?q\x3dhttp%3A%2F%2Fcom.google.gwt.dev.jjs.impl.Gw\x26sa\x3dD\x26sntz\x3d1\x26usg\x3dAFQjCNGvRJR19AQt0TfIqvq7txcCEfSF0g&#39;;return true;">com.google.gwt.dev.jjs.impl.GwtAstBuilder$AstVisitor.processEnumType(GwtAstBuilder.java:2425)
at <a href="http://com.google.gwt.dev.jjs.impl.Gw" target="_blank" rel="nofollow" onmousedown="this.href=&#39;http://www.google.com/url?q\x3dhttp%3A%2F%2Fcom.google.gwt.dev.jjs.impl.Gw\x26sa\x3dD\x26sntz\x3d1\x26usg\x3dAFQjCNGvRJR19AQt0TfIqvq7txcCEfSF0g&#39;;return true;" onclick="this.href=&#39;http://www.google.com/url?q\x3dhttp%3A%2F%2Fcom.google.gwt.dev.jjs.impl.Gw\x26sa\x3dD\x26sntz\x3d1\x26usg\x3dAFQjCNGvRJR19AQt0TfIqvq7txcCEfSF0g&#39;;return true;">com.google.gwt.dev.jjs.impl.GwtAstBuilder$AstVisitor.endVisit(GwtAstBuilder.java:1861)
at <a href="http://com.google.gwt.dev.jjs.impl.Gw" target="_blank" rel="nofollow" onmousedown="this.href=&#39;http://www.google.com/url?q\x3dhttp%3A%2F%2Fcom.google.gwt.dev.jjs.impl.Gw\x26sa\x3dD\x26sntz\x3d1\x26usg\x3dAFQjCNGvRJR19AQt0TfIqvq7txcCEfSF0g&#39;;return true;" onclick="this.href=&#39;http://www.google.com/url?q\x3dhttp%3A%2F%2Fcom.google.gwt.dev.jjs.impl.Gw\x26sa\x3dD\x26sntz\x3d1\x26usg\x3dAFQjCNGvRJR19AQt0TfIqvq7txcCEfSF0g&#39;;return true;">com.google.gwt.dev.jjs.impl.GwtAstBuilder$AstVisitor.endVisit(GwtAstBuilder.java:1588)
at org.eclipse.jdt.internal.compiler.ast.TypeDeclaration.traverse(TypeDeclaration.java:1382)
at <a href="http://com.google.gwt.dev.jjs.impl.Gw" target="_blank" rel="nofollow" onmousedown="this.href=&#39;http://www.google.com/url?q\x3dhttp%3A%2F%2Fcom.google.gwt.dev.jjs.impl.Gw\x26sa\x3dD\x26sntz\x3d1\x26usg\x3dAFQjCNGvRJR19AQt0TfIqvq7txcCEfSF0g&#39;;return true;" onclick="this.href=&#39;http://www.google.com/url?q\x3dhttp%3A%2F%2Fcom.google.gwt.dev.jjs.impl.Gw\x26sa\x3dD\x26sntz\x3d1\x26usg\x3dAFQjCNGvRJR19AQt0TfIqvq7txcCEfSF0g&#39;;return true;">com.google.gwt.dev.jjs.impl.GwtAstBuilder.process(GwtAstBuilder.java:3058)
at com.google.gwt.dev.javac.CompilationStateBuilder$CompileMoreLater$UnitProcessorImpl.process(CompilationStateBuilder.java:141)
at com.google.gwt.dev.javac.JdtCompiler$CompilerImpl.process(JdtCompiler.java:384)
at org.eclipse.jdt.internal.compiler.Compiler.compile(Compiler.java:470)
at com.google.gwt.dev.javac.JdtCompiler.doCompile(JdtCompiler.java:985)
at com.google.gwt.dev.javac.CompilationStateBuilder$CompileMoreLater.compile(CompilationStateBuilder.java:339)
at com.google.gwt.dev.javac.CompilationStateBuilder.doBuildFrom(CompilationStateBuilder.java:580)
at com.google.gwt.dev.javac.CompilationStateBuilder.buildFrom(CompilationStateBuilder.java:513)
at com.google.gwt.dev.javac.CompilationStateBuilder.buildFrom(CompilationStateBuilder.java:499)
at com.google.gwt.dev.cfg.ModuleDef.getCompilationState(ModuleDef.java:668)
at com.google.gwt.dev.Precompile.precompile(Precompile.java:255)
at com.google.gwt.dev.Precompile.precompile(Precompile.java:229)
at com.google.gwt.dev.Precompile.precompile(Precompile.java:145)
at <a href="http://com.google.gwt.dev.Compiler.ru" target="_blank" rel="nofollow" onmousedown="this.href=&#39;http://www.google.com/url?q\x3dhttp%3A%2F%2Fcom.google.gwt.dev.Compiler.ru\x26sa\x3dD\x26sntz\x3d1\x26usg\x3dAFQjCNFXMquzc8TxB0aHR83Q3A5h350ARA&#39;;return true;" onclick="this.href=&#39;http://www.google.com/url?q\x3dhttp%3A%2F%2Fcom.google.gwt.dev.Compiler.ru\x26sa\x3dD\x26sntz\x3d1\x26usg\x3dAFQjCNFXMquzc8TxB0aHR83Q3A5h350ARA&#39;;return true;">com.google.gwt.dev.Compiler.run(Compiler.java:206)
at <a href="http://com.google.gwt.dev.Compiler.ru" target="_blank" rel="nofollow" onmousedown="this.href=&#39;http://www.google.com/url?q\x3dhttp%3A%2F%2Fcom.google.gwt.dev.Compiler.ru\x26sa\x3dD\x26sntz\x3d1\x26usg\x3dAFQjCNFXMquzc8TxB0aHR83Q3A5h350ARA&#39;;return true;" onclick="this.href=&#39;http://www.google.com/url?q\x3dhttp%3A%2F%2Fcom.google.gwt.dev.Compiler.ru\x26sa\x3dD\x26sntz\x3d1\x26usg\x3dAFQjCNFXMquzc8TxB0aHR83Q3A5h350ARA&#39;;return true;">com.google.gwt.dev.Compiler.run(Compiler.java:158)
at com.google.gwt.dev.Compiler$1.run(Compiler.java:120)
at com.google.gwt.dev.CompileTaskRunner.doRun(CompileTaskRunner.java:55)
at com.google.gwt.dev.CompileTaskRunner.runWithAppropriateLogger(CompileTaskRunner.java:50)
at <a href="http://com.google.gwt.dev.Compiler.ma" target="_blank" rel="nofollow" onmousedown="this.href=&#39;http://www.google.com/url?q\x3dhttp%3A%2F%2Fcom.google.gwt.dev.Compiler.ma\x26sa\x3dD\x26sntz\x3d1\x26usg\x3dAFQjCNE26rMIDLoGeU5tDGPG7zFu_NzTZQ&#39;;return true;" onclick="this.href=&#39;http://www.google.com/url?q\x3dhttp%3A%2F%2Fcom.google.gwt.dev.Compiler.ma\x26sa\x3dD\x26sntz\x3d1\x26usg\x3dAFQjCNE26rMIDLoGeU5tDGPG7zFu_NzTZQ&#39;;return true;">com.google.gwt.dev.Compiler.main(Compiler.java:127)
:modules:qi-core:vaadinCompile FAILED

FAILURE: Build failed with an exception.

* What went wrong:
Execution failed for task ':modules:qi-core:vaadinCompile'.
> Widgetset failed to compile. See error log.


Am I missing anything??

- Rajesh

--
--
jPOS is licensed under AGPL - free for community usage for your open-source project. Licenses are also available for commercial usage. Please support jPOS, contact: [hidden email]
---
You received this message because you are subscribed to the Google Groups "jPOS Users" group.
To unsubscribe from this group and stop receiving emails from it, send an email to jpos-users+unsubscribe@googlegroups.com.
To post to this group, send email to [hidden email].
To view this discussion on the web visit <a href="https://groups.google.com/d/msgid/jpos-users/3c01d42c-0a03-4dd5-8ed4-bbf4eafcf96d%40googlegroups.com?utm_medium=email&amp;utm_source=footer" target="_blank" rel="nofollow" onmousedown="this.href=&#39;https://groups.google.com/d/msgid/jpos-users/3c01d42c-0a03-4dd5-8ed4-bbf4eafcf96d%40googlegroups.com?utm_medium\x3demail\x26utm_source\x3dfooter&#39;;return true;" onclick="this.href=&#39;https://groups.google.com/d/msgid/jpos-users/3c01d42c-0a03-4dd5-8ed4-bbf4eafcf96d%40googlegroups.com?utm_medium\x3demail\x26utm_source\x3dfooter&#39;;return true;">https://groups.google.com/d/msgid/jpos-users/3c01d42c-0a03-4dd5-8ed4-bbf4eafcf96d%40googlegroups.com.

For more options, visit <a href="https://groups.google.com/d/optout" target="_blank" rel="nofollow" onmousedown="this.href=&#39;https://groups.google.com/d/optout&#39;;return true;" onclick="this.href=&#39;https://groups.google.com/d/optout&#39;;return true;">https://groups.google.com/d/optout.

--
--
jPOS is licensed under AGPL - free for community usage for your open-source project. Licenses are also available for commercial usage. Please support jPOS, contact: [hidden email]
---
You received this message because you are subscribed to the Google Groups "jPOS Users" group.
To unsubscribe from this group and stop receiving emails from it, send an email to jpos-users+unsubscribe@googlegroups.com.
To post to this group, send email to [hidden email].
To view this discussion on the web visit <a href="https://groups.google.com/d/msgid/jpos-users/CAPazefAjVkfx7qD6iP300UC3fkm_n60aKcznZnVvDd%2B9Zvff%3Dg%40mail.gmail.com?utm_medium=email&amp;utm_source=footer" target="_blank" rel="nofollow" onmousedown="this.href=&#39;https://groups.google.com/d/msgid/jpos-users/CAPazefAjVkfx7qD6iP300UC3fkm_n60aKcznZnVvDd%2B9Zvff%3Dg%40mail.gmail.com?utm_medium\x3demail\x26utm_source\x3dfooter&#39;;return true;" onclick="this.href=&#39;https://groups.google.com/d/msgid/jpos-users/CAPazefAjVkfx7qD6iP300UC3fkm_n60aKcznZnVvDd%2B9Zvff%3Dg%40mail.gmail.com?utm_medium\x3demail\x26utm_source\x3dfooter&#39;;return true;">https://groups.google.com/d/msgid/jpos-users/CAPazefAjVkfx7qD6iP300UC3fkm_n60aKcznZnVvDd%2B9Zvff%3Dg%40mail.gmail.com.
For more options, visit <a href="https://groups.google.com/d/optout" target="_blank" rel="nofollow" onmousedown="this.href=&#39;https://groups.google.com/d/optout&#39;;return true;" onclick="this.href=&#39;https://groups.google.com/d/optout&#39;;return true;">https://groups.google.com/d/optout.


--
Barzilai Spinak
Transactility, Inc.
<a href="http://www.transactility.com" target="_blank" rel="nofollow" onmousedown="this.href=&#39;http://www.google.com/url?q\x3dhttp%3A%2F%2Fwww.transactility.com\x26sa\x3dD\x26sntz\x3d1\x26usg\x3dAFQjCNH2Sie_sItmzefqi-CBIeBxkqnuwQ&#39;;return true;" onclick="this.href=&#39;http://www.google.com/url?q\x3dhttp%3A%2F%2Fwww.transactility.com\x26sa\x3dD\x26sntz\x3d1\x26usg\x3dAFQjCNH2Sie_sItmzefqi-CBIeBxkqnuwQ&#39;;return true;">www.transactility.com
"Commercial licensing and support for the jPOS.org project"

--
--
jPOS is licensed under AGPL - free for community usage for your open-source project. Licenses are also available for commercial usage. Please support jPOS, contact: <a href="javascript:" target="_blank" gdf-obfuscated-mailto="0ML7FVAfAAAJ" rel="nofollow" onmousedown="this.href=&#39;javascript:&#39;;return true;" onclick="this.href=&#39;javascript:&#39;;return true;">sa...@...
---
You received this message because you are subscribed to the Google Groups "jPOS Users" group.
To unsubscribe from this group and stop receiving emails from it, send an email to <a href="javascript:" target="_blank" gdf-obfuscated-mailto="0ML7FVAfAAAJ" rel="nofollow" onmousedown="this.href=&#39;javascript:&#39;;return true;" onclick="this.href=&#39;javascript:&#39;;return true;">jpos-users+...@googlegroups.com.
To post to this group, send email to <a href="javascript:" target="_blank" gdf-obfuscated-mailto="0ML7FVAfAAAJ" rel="nofollow" onmousedown="this.href=&#39;javascript:&#39;;return true;" onclick="this.href=&#39;javascript:&#39;;return true;">jpos-...@....
To view this discussion on the web visit <a href="https://groups.google.com/d/msgid/jpos-users/CAMUbAtzBtWE%2BEDYSYrwDc6UefkhSF3BePP04HLZbvhROU%2BcErQ%40mail.gmail.com?utm_medium=email&amp;utm_source=footer" target="_blank" rel="nofollow" onmousedown="this.href=&#39;https://groups.google.com/d/msgid/jpos-users/CAMUbAtzBtWE%2BEDYSYrwDc6UefkhSF3BePP04HLZbvhROU%2BcErQ%40mail.gmail.com?utm_medium\x3demail\x26utm_source\x3dfooter&#39;;return true;" onclick="this.href=&#39;https://groups.google.com/d/msgid/jpos-users/CAMUbAtzBtWE%2BEDYSYrwDc6UefkhSF3BePP04HLZbvhROU%2BcErQ%40mail.gmail.com?utm_medium\x3demail\x26utm_source\x3dfooter&#39;;return true;">https://groups.google.com/d/msgid/jpos-users/CAMUbAtzBtWE%2BEDYSYrwDc6UefkhSF3BePP04HLZbvhROU%2BcErQ%40mail.gmail.com.

For more options, visit <a href="https://groups.google.com/d/optout" target="_blank" rel="nofollow" onmousedown="this.href=&#39;https://groups.google.com/d/optout&#39;;return true;" onclick="this.href=&#39;https://groups.google.com/d/optout&#39;;return true;">https://groups.google.com/d/optout.

--
--
jPOS is licensed under AGPL - free for community usage for your open-source project. Licenses are also available for commercial usage. Please support jPOS, contact: <a href="javascript:" target="_blank" gdf-obfuscated-mailto="0ML7FVAfAAAJ" rel="nofollow" onmousedown="this.href=&#39;javascript:&#39;;return true;" onclick="this.href=&#39;javascript:&#39;;return true;">sa...@...
---
You received this message because you are subscribed to the Google Groups "jPOS Users" group.
To unsubscribe from this group and stop receiving emails from it, send an email to <a href="javascript:" target="_blank" gdf-obfuscated-mailto="0ML7FVAfAAAJ" rel="nofollow" onmousedown="this.href=&#39;javascript:&#39;;return true;" onclick="this.href=&#39;javascript:&#39;;return true;">jpos-users+...@googlegroups.com.
To post to this group, send email to <a href="javascript:" target="_blank" gdf-obfuscated-mailto="0ML7FVAfAAAJ" rel="nofollow" onmousedown="this.href=&#39;javascript:&#39;;return true;" onclick="this.href=&#39;javascript:&#39;;return true;">jpos-...@....
To view this discussion on the web visit <a href="https://groups.google.com/d/msgid/jpos-users/CAPazefAHiuwGmsiEH1ROK6KQFNiC%3DobS7NpPmespY8rArwfM0A%40mail.gmail.com?utm_medium=email&amp;utm_source=footer" target="_blank" rel="nofollow" onmousedown="this.href=&#39;https://groups.google.com/d/msgid/jpos-users/CAPazefAHiuwGmsiEH1ROK6KQFNiC%3DobS7NpPmespY8rArwfM0A%40mail.gmail.com?utm_medium\x3demail\x26utm_source\x3dfooter&#39;;return true;" onclick="this.href=&#39;https://groups.google.com/d/msgid/jpos-users/CAPazefAHiuwGmsiEH1ROK6KQFNiC%3DobS7NpPmespY8rArwfM0A%40mail.gmail.com?utm_medium\x3demail\x26utm_source\x3dfooter&#39;;return true;">https://groups.google.com/d/msgid/jpos-users/CAPazefAHiuwGmsiEH1ROK6KQFNiC%3DobS7NpPmespY8rArwfM0A%40mail.gmail.com.

For more options, visit <a href="https://groups.google.com/d/optout" target="_blank" rel="nofollow" onmousedown="this.href=&#39;https://groups.google.com/d/optout&#39;;return true;" onclick="this.href=&#39;https://groups.google.com/d/optout&#39;;return true;">https://groups.google.com/d/optout.

--
--
jPOS is licensed under AGPL - free for community usage for your open-source project. Licenses are also available for commercial usage. Please support jPOS, contact: [hidden email]
---
You received this message because you are subscribed to the Google Groups "jPOS Users" group.
To unsubscribe from this group and stop receiving emails from it, send an email to [hidden email].
To post to this group, send email to [hidden email].
To view this discussion on the web visit https://groups.google.com/d/msgid/jpos-users/ec7c6821-c283-4c85-ba0b-876bae1d3c18%40googlegroups.com.
For more options, visit https://groups.google.com/d/optout.
Reply | Threaded
Open this post in threaded view
|

Re: [jpos-users] jposee : gradle install error

Janta Darbar
I mean ..  'gradle install'  is successful. It is not throwing gwt errors in windows environement.




On Friday, May 5, 2017 at 11:50:33 PM UTC-5, Janta Darbar wrote:
I changed the boolean values to "true"  in following lines in "modules\qi-core\build.gradle"  file : 

manageDependencies = true
vaadinCompile.gwtSdkFirstInClasspath=true

Now, the jposee 'gradle build'  in Windows environment is successful.

Kind regards,
Raj


On Tuesday, May 2, 2017 at 2:40:34 PM UTC-5, Alejandro Revilla wrote:
Dave was kind enough to provide a fix for the BinLog issue and it now builds OK in Windows (<a href="https://github.com/jpos/jPOS/pull/128" rel="nofollow" target="_blank" onmousedown="this.href=&#39;https://www.google.com/url?q\x3dhttps%3A%2F%2Fgithub.com%2Fjpos%2FjPOS%2Fpull%2F128\x26sa\x3dD\x26sntz\x3d1\x26usg\x3dAFQjCNGpjYmL4HnGV6519l1BWO9gIpWVOw&#39;;return true;" onclick="this.href=&#39;https://www.google.com/url?q\x3dhttps%3A%2F%2Fgithub.com%2Fjpos%2FjPOS%2Fpull%2F128\x26sa\x3dD\x26sntz\x3d1\x26usg\x3dAFQjCNGpjYmL4HnGV6519l1BWO9gIpWVOw&#39;;return true;">https://github.com/jpos/jPOS/pull/128).

The GWT issue doesn't show up in Jenkins/Windows so it must be something else.



--
<a style="font-family:garamond,serif" href="http://twitter.com/apr" rel="nofollow" target="_blank" onmousedown="this.href=&#39;http://www.google.com/url?q\x3dhttp%3A%2F%2Ftwitter.com%2Fapr\x26sa\x3dD\x26sntz\x3d1\x26usg\x3dAFQjCNFRt8creb486OVHOJ12erdzV1NRIg&#39;;return true;" onclick="this.href=&#39;http://www.google.com/url?q\x3dhttp%3A%2F%2Ftwitter.com%2Fapr\x26sa\x3dD\x26sntz\x3d1\x26usg\x3dAFQjCNFRt8creb486OVHOJ12erdzV1NRIg&#39;;return true;">@apr

On Sat, Apr 29, 2017 at 2:11 AM, chhil <[hidden email]> wrote:
I tried getting various zips for build till <a href="https://github.com/jpos/jPOS-EE/tree/6dba6c83c867b207123b28a052d53fe6188ae934" rel="nofollow" target="_blank" onmousedown="this.href=&#39;https://www.google.com/url?q\x3dhttps%3A%2F%2Fgithub.com%2Fjpos%2FjPOS-EE%2Ftree%2F6dba6c83c867b207123b28a052d53fe6188ae934\x26sa\x3dD\x26sntz\x3d1\x26usg\x3dAFQjCNFTXyZrCxDBexkGhdoxgV1p5yP0hw&#39;;return true;" onclick="this.href=&#39;https://www.google.com/url?q\x3dhttps%3A%2F%2Fgithub.com%2Fjpos%2FjPOS-EE%2Ftree%2F6dba6c83c867b207123b28a052d53fe6188ae934\x26sa\x3dD\x26sntz\x3d1\x26usg\x3dAFQjCNFTXyZrCxDBexkGhdoxgV1p5yP0hw&#39;;return true;">https://github.com/jpos/jPOS-EE/tree/6dba6c83c867b207123b28a052d53fe6188ae934

I reached Sep 24 2016

​(sha 
6dba6c83c867b207123b28a052d53fe6188ae934
​)​

and could not build

​ (on Win10 Java 8)​
, though the build error was

Unexpected internal compiler error
java.lang.IncompatibleClassChangeError: class com.google.gwt.dev.javac.asm.CollectMethodData has interface org.objectweb.asm.MethodVisitor as super class
at java.lang.ClassLoader.defineClass1(Native Method)
at java.lang.ClassLoader.defineClass(ClassLoader.java:760)
at java.security.SecureClassLoader.defineClass(SecureClassLoader.java:142)
at java.net.URLClassLoader.defineClass(URLClassLoader.java:467)
at java.net.URLClassLoader.access$100(URLClassLoader.java:73)
...
...
:modules:qi-core:vaadinCompile FAILED
-chhil​





On Sat, Apr 29, 2017 at 10:03 AM, Barzilai Spinak <[hidden email]> wrote:
can anyone do a git bisect and find out which commit introduced the error?


On Friday, April 28, 2017, chhil <[hidden email]> wrote:

Got the zip via <a href="https://github.com/jpos/jPOS-EE/archive/master.zip" rel="nofollow" target="_blank" onmousedown="this.href=&#39;https://www.google.com/url?q\x3dhttps%3A%2F%2Fgithub.com%2Fjpos%2FjPOS-EE%2Farchive%2Fmaster.zip\x26sa\x3dD\x26sntz\x3d1\x26usg\x3dAFQjCNFSTIIJ3X5bIqb_PSkmk6HaZphGIQ&#39;;return true;" onclick="this.href=&#39;https://www.google.com/url?q\x3dhttps%3A%2F%2Fgithub.com%2Fjpos%2FjPOS-EE%2Farchive%2Fmaster.zip\x26sa\x3dD\x26sntz\x3d1\x26usg\x3dAFQjCNFSTIIJ3X5bIqb_PSkmk6HaZphGIQ&#39;;return true;">https://github.com/jpos/jPOS-EE/archive/master.zip

unzipped on win10 to C:\Temp\jPOS-EE-master and 

ran gradlew.bat ran gradlew install

got the error as seen by users in the thread.

Then used the same location as a mounted volume in my local docker image jpos/ubuntu_vivid_jdk8_unlimited 

docker run -t -i -v C:\Temp\jPOS-EE-master:/opt/jposee jpos/ubuntu_vivid_jdk8_unlimited

​​
ran ./gradlew ran ./gradlew install

Build generated.

-chhil  

On Fri, Apr 28, 2017 at 5:14 AM, adhi nugroho <[hidden email]> wrote:
yes..i have a same problem with that on windows 10 

Unexpected internal compiler error
java
.lang.RuntimeException: Unexpectedly unable to access Enum.createValueOfMap via reflection. Likely a dependency on the com.google.gwt.user.User module is missing.
at com
.google.gwt.dev.jjs.impl.GwtAstBuilder$AstVisitor.writeEnumValueOfMethod(GwtAstBuilder.java:2793)
at com
.google.gwt.dev.jjs.impl.GwtAstBuilder$AstVisitor.processEnumType(GwtAstBuilder.java:2425)
at com
.google.gwt.dev.jjs.impl.GwtAstBuilder$AstVisitor.endVisit(GwtAstBuilder.java:1861)
at com
.google.gwt.dev.jjs.impl.GwtAstBuilder$AstVisitor.endVisit(GwtAstBuilder.java:1588)
at org
.eclipse.jdt.internal.compiler.ast.TypeDeclaration.traverse(TypeDeclaration.java:1382)
at com
.google.gwt.dev.jjs.impl.GwtAstBuilder.process(GwtAstBuilder.java:3058)
at com
.google.gwt.dev.javac.CompilationStateBuilder$CompileMoreLater$UnitProcessorImpl.process(CompilationStateBuilder.java:141)


On Friday, April 28, 2017 at 5:23:58 AM UTC+7, Janta Darbar wrote:
Can anybody please confirm if they have installed latest JPosEE master in their windows machine?

-Raj



On Wednesday, April 26, 2017 at 9:08:17 PM UTC-5, Janta Darbar wrote:
my laptop is windows 10.

I downloaded the JPosEE Master and tried to Gradle install.

I am using gradle 3.5
java JDK : 1.8.0_121

>gradle install

It is throwing error as follows:

:modules:qi-core:vaadinCompile
Unexpected internal compiler error
java.lang.RuntimeException: Unexpectedly unable to access Enum.createValueOfMap via reflection. Likely a dependency on the com.google.gwt.user.User module is missing.
at <a href="http://com.google.gwt.dev.jjs.impl.Gw" rel="nofollow" target="_blank" onmousedown="this.href=&#39;http://www.google.com/url?q\x3dhttp%3A%2F%2Fcom.google.gwt.dev.jjs.impl.Gw\x26sa\x3dD\x26sntz\x3d1\x26usg\x3dAFQjCNGvRJR19AQt0TfIqvq7txcCEfSF0g&#39;;return true;" onclick="this.href=&#39;http://www.google.com/url?q\x3dhttp%3A%2F%2Fcom.google.gwt.dev.jjs.impl.Gw\x26sa\x3dD\x26sntz\x3d1\x26usg\x3dAFQjCNGvRJR19AQt0TfIqvq7txcCEfSF0g&#39;;return true;">com.google.gwt.dev.jjs.impl.GwtAstBuilder$AstVisitor.writeEnumValueOfMethod(GwtAstBuilder.java:2793)
at <a href="http://com.google.gwt.dev.jjs.impl.Gw" rel="nofollow" target="_blank" onmousedown="this.href=&#39;http://www.google.com/url?q\x3dhttp%3A%2F%2Fcom.google.gwt.dev.jjs.impl.Gw\x26sa\x3dD\x26sntz\x3d1\x26usg\x3dAFQjCNGvRJR19AQt0TfIqvq7txcCEfSF0g&#39;;return true;" onclick="this.href=&#39;http://www.google.com/url?q\x3dhttp%3A%2F%2Fcom.google.gwt.dev.jjs.impl.Gw\x26sa\x3dD\x26sntz\x3d1\x26usg\x3dAFQjCNGvRJR19AQt0TfIqvq7txcCEfSF0g&#39;;return true;">com.google.gwt.dev.jjs.impl.GwtAstBuilder$AstVisitor.processEnumType(GwtAstBuilder.java:2425)
at <a href="http://com.google.gwt.dev.jjs.impl.Gw" rel="nofollow" target="_blank" onmousedown="this.href=&#39;http://www.google.com/url?q\x3dhttp%3A%2F%2Fcom.google.gwt.dev.jjs.impl.Gw\x26sa\x3dD\x26sntz\x3d1\x26usg\x3dAFQjCNGvRJR19AQt0TfIqvq7txcCEfSF0g&#39;;return true;" onclick="this.href=&#39;http://www.google.com/url?q\x3dhttp%3A%2F%2Fcom.google.gwt.dev.jjs.impl.Gw\x26sa\x3dD\x26sntz\x3d1\x26usg\x3dAFQjCNGvRJR19AQt0TfIqvq7txcCEfSF0g&#39;;return true;">com.google.gwt.dev.jjs.impl.GwtAstBuilder$AstVisitor.endVisit(GwtAstBuilder.java:1861)
at <a href="http://com.google.gwt.dev.jjs.impl.Gw" rel="nofollow" target="_blank" onmousedown="this.href=&#39;http://www.google.com/url?q\x3dhttp%3A%2F%2Fcom.google.gwt.dev.jjs.impl.Gw\x26sa\x3dD\x26sntz\x3d1\x26usg\x3dAFQjCNGvRJR19AQt0TfIqvq7txcCEfSF0g&#39;;return true;" onclick="this.href=&#39;http://www.google.com/url?q\x3dhttp%3A%2F%2Fcom.google.gwt.dev.jjs.impl.Gw\x26sa\x3dD\x26sntz\x3d1\x26usg\x3dAFQjCNGvRJR19AQt0TfIqvq7txcCEfSF0g&#39;;return true;">com.google.gwt.dev.jjs.impl.GwtAstBuilder$AstVisitor.endVisit(GwtAstBuilder.java:1588)
at org.eclipse.jdt.internal.compiler.ast.TypeDeclaration.traverse(TypeDeclaration.java:1382)
at <a href="http://com.google.gwt.dev.jjs.impl.Gw" rel="nofollow" target="_blank" onmousedown="this.href=&#39;http://www.google.com/url?q\x3dhttp%3A%2F%2Fcom.google.gwt.dev.jjs.impl.Gw\x26sa\x3dD\x26sntz\x3d1\x26usg\x3dAFQjCNGvRJR19AQt0TfIqvq7txcCEfSF0g&#39;;return true;" onclick="this.href=&#39;http://www.google.com/url?q\x3dhttp%3A%2F%2Fcom.google.gwt.dev.jjs.impl.Gw\x26sa\x3dD\x26sntz\x3d1\x26usg\x3dAFQjCNGvRJR19AQt0TfIqvq7txcCEfSF0g&#39;;return true;">com.google.gwt.dev.jjs.impl.GwtAstBuilder.process(GwtAstBuilder.java:3058)
at com.google.gwt.dev.javac.CompilationStateBuilder$CompileMoreLater$UnitProcessorImpl.process(CompilationStateBuilder.java:141)
at com.google.gwt.dev.javac.JdtCompiler$CompilerImpl.process(JdtCompiler.java:384)
at org.eclipse.jdt.internal.compiler.Compiler.compile(Compiler.java:470)
at com.google.gwt.dev.javac.JdtCompiler.doCompile(JdtCompiler.java:985)
at com.google.gwt.dev.javac.CompilationStateBuilder$CompileMoreLater.compile(CompilationStateBuilder.java:339)
at com.google.gwt.dev.javac.CompilationStateBuilder.doBuildFrom(CompilationStateBuilder.java:580)
at com.google.gwt.dev.javac.CompilationStateBuilder.buildFrom(CompilationStateBuilder.java:513)
at com.google.gwt.dev.javac.CompilationStateBuilder.buildFrom(CompilationStateBuilder.java:499)
at com.google.gwt.dev.cfg.ModuleDef.getCompilationState(ModuleDef.java:668)
at com.google.gwt.dev.Precompile.precompile(Precompile.java:255)
at com.google.gwt.dev.Precompile.precompile(Precompile.java:229)
at com.google.gwt.dev.Precompile.precompile(Precompile.java:145)
at <a href="http://com.google.gwt.dev.Compiler.ru" rel="nofollow" target="_blank" onmousedown="this.href=&#39;http://www.google.com/url?q\x3dhttp%3A%2F%2Fcom.google.gwt.dev.Compiler.ru\x26sa\x3dD\x26sntz\x3d1\x26usg\x3dAFQjCNFXMquzc8TxB0aHR83Q3A5h350ARA&#39;;return true;" onclick="this.href=&#39;http://www.google.com/url?q\x3dhttp%3A%2F%2Fcom.google.gwt.dev.Compiler.ru\x26sa\x3dD\x26sntz\x3d1\x26usg\x3dAFQjCNFXMquzc8TxB0aHR83Q3A5h350ARA&#39;;return true;">com.google.gwt.dev.Compiler.run(Compiler.java:206)
at <a href="http://com.google.gwt.dev.Compiler.ru" rel="nofollow" target="_blank" onmousedown="this.href=&#39;http://www.google.com/url?q\x3dhttp%3A%2F%2Fcom.google.gwt.dev.Compiler.ru\x26sa\x3dD\x26sntz\x3d1\x26usg\x3dAFQjCNFXMquzc8TxB0aHR83Q3A5h350ARA&#39;;return true;" onclick="this.href=&#39;http://www.google.com/url?q\x3dhttp%3A%2F%2Fcom.google.gwt.dev.Compiler.ru\x26sa\x3dD\x26sntz\x3d1\x26usg\x3dAFQjCNFXMquzc8TxB0aHR83Q3A5h350ARA&#39;;return true;">com.google.gwt.dev.Compiler.run(Compiler.java:158)
at com.google.gwt.dev.Compiler$1.run(Compiler.java:120)
at com.google.gwt.dev.CompileTaskRunner.doRun(CompileTaskRunner.java:55)
at com.google.gwt.dev.CompileTaskRunner.runWithAppropriateLogger(CompileTaskRunner.java:50)
at <a href="http://com.google.gwt.dev.Compiler.ma" rel="nofollow" target="_blank" onmousedown="this.href=&#39;http://www.google.com/url?q\x3dhttp%3A%2F%2Fcom.google.gwt.dev.Compiler.ma\x26sa\x3dD\x26sntz\x3d1\x26usg\x3dAFQjCNE26rMIDLoGeU5tDGPG7zFu_NzTZQ&#39;;return true;" onclick="this.href=&#39;http://www.google.com/url?q\x3dhttp%3A%2F%2Fcom.google.gwt.dev.Compiler.ma\x26sa\x3dD\x26sntz\x3d1\x26usg\x3dAFQjCNE26rMIDLoGeU5tDGPG7zFu_NzTZQ&#39;;return true;">com.google.gwt.dev.Compiler.main(Compiler.java:127)
:modules:qi-core:vaadinCompile FAILED

FAILURE: Build failed with an exception.

* What went wrong:
Execution failed for task ':modules:qi-core:vaadinCompile'.
> Widgetset failed to compile. See error log.


Am I missing anything??

- Rajesh

--
--
jPOS is licensed under AGPL - free for community usage for your open-source project. Licenses are also available for commercial usage. Please support jPOS, contact: [hidden email]
---
You received this message because you are subscribed to the Google Groups "jPOS Users" group.
To unsubscribe from this group and stop receiving emails from it, send an email to jpos-users+unsubscribe@googlegroups.com.
To post to this group, send email to [hidden email].
To view this discussion on the web visit <a href="https://groups.google.com/d/msgid/jpos-users/3c01d42c-0a03-4dd5-8ed4-bbf4eafcf96d%40googlegroups.com?utm_medium=email&amp;utm_source=footer" rel="nofollow" target="_blank" onmousedown="this.href=&#39;https://groups.google.com/d/msgid/jpos-users/3c01d42c-0a03-4dd5-8ed4-bbf4eafcf96d%40googlegroups.com?utm_medium\x3demail\x26utm_source\x3dfooter&#39;;return true;" onclick="this.href=&#39;https://groups.google.com/d/msgid/jpos-users/3c01d42c-0a03-4dd5-8ed4-bbf4eafcf96d%40googlegroups.com?utm_medium\x3demail\x26utm_source\x3dfooter&#39;;return true;">https://groups.google.com/d/msgid/jpos-users/3c01d42c-0a03-4dd5-8ed4-bbf4eafcf96d%40googlegroups.com.

For more options, visit <a href="https://groups.google.com/d/optout" rel="nofollow" target="_blank" onmousedown="this.href=&#39;https://groups.google.com/d/optout&#39;;return true;" onclick="this.href=&#39;https://groups.google.com/d/optout&#39;;return true;">https://groups.google.com/d/optout.

--
--
jPOS is licensed under AGPL - free for community usage for your open-source project. Licenses are also available for commercial usage. Please support jPOS, contact: [hidden email]
---
You received this message because you are subscribed to the Google Groups "jPOS Users" group.
To unsubscribe from this group and stop receiving emails from it, send an email to jpos-users+unsubscribe@googlegroups.com.
To post to this group, send email to [hidden email].
To view this discussion on the web visit <a href="https://groups.google.com/d/msgid/jpos-users/CAPazefAjVkfx7qD6iP300UC3fkm_n60aKcznZnVvDd%2B9Zvff%3Dg%40mail.gmail.com?utm_medium=email&amp;utm_source=footer" rel="nofollow" target="_blank" onmousedown="this.href=&#39;https://groups.google.com/d/msgid/jpos-users/CAPazefAjVkfx7qD6iP300UC3fkm_n60aKcznZnVvDd%2B9Zvff%3Dg%40mail.gmail.com?utm_medium\x3demail\x26utm_source\x3dfooter&#39;;return true;" onclick="this.href=&#39;https://groups.google.com/d/msgid/jpos-users/CAPazefAjVkfx7qD6iP300UC3fkm_n60aKcznZnVvDd%2B9Zvff%3Dg%40mail.gmail.com?utm_medium\x3demail\x26utm_source\x3dfooter&#39;;return true;">https://groups.google.com/d/msgid/jpos-users/CAPazefAjVkfx7qD6iP300UC3fkm_n60aKcznZnVvDd%2B9Zvff%3Dg%40mail.gmail.com.
For more options, visit <a href="https://groups.google.com/d/optout" rel="nofollow" target="_blank" onmousedown="this.href=&#39;https://groups.google.com/d/optout&#39;;return true;" onclick="this.href=&#39;https://groups.google.com/d/optout&#39;;return true;">https://groups.google.com/d/optout.


--
Barzilai Spinak
Transactility, Inc.
<a href="http://www.transactility.com" rel="nofollow" target="_blank" onmousedown="this.href=&#39;http://www.google.com/url?q\x3dhttp%3A%2F%2Fwww.transactility.com\x26sa\x3dD\x26sntz\x3d1\x26usg\x3dAFQjCNH2Sie_sItmzefqi-CBIeBxkqnuwQ&#39;;return true;" onclick="this.href=&#39;http://www.google.com/url?q\x3dhttp%3A%2F%2Fwww.transactility.com\x26sa\x3dD\x26sntz\x3d1\x26usg\x3dAFQjCNH2Sie_sItmzefqi-CBIeBxkqnuwQ&#39;;return true;">www.transactility.com
"Commercial licensing and support for the jPOS.org project"

--
--
jPOS is licensed under AGPL - free for community usage for your open-source project. Licenses are also available for commercial usage. Please support jPOS, contact: [hidden email]
---
You received this message because you are subscribed to the Google Groups "jPOS Users" group.
To unsubscribe from this group and stop receiving emails from it, send an email to jpos-users+...@googlegroups.com.
To post to this group, send email to [hidden email].
To view this discussion on the web visit <a href="https://groups.google.com/d/msgid/jpos-users/CAMUbAtzBtWE%2BEDYSYrwDc6UefkhSF3BePP04HLZbvhROU%2BcErQ%40mail.gmail.com?utm_medium=email&amp;utm_source=footer" rel="nofollow" target="_blank" onmousedown="this.href=&#39;https://groups.google.com/d/msgid/jpos-users/CAMUbAtzBtWE%2BEDYSYrwDc6UefkhSF3BePP04HLZbvhROU%2BcErQ%40mail.gmail.com?utm_medium\x3demail\x26utm_source\x3dfooter&#39;;return true;" onclick="this.href=&#39;https://groups.google.com/d/msgid/jpos-users/CAMUbAtzBtWE%2BEDYSYrwDc6UefkhSF3BePP04HLZbvhROU%2BcErQ%40mail.gmail.com?utm_medium\x3demail\x26utm_source\x3dfooter&#39;;return true;">https://groups.google.com/d/msgid/jpos-users/CAMUbAtzBtWE%2BEDYSYrwDc6UefkhSF3BePP04HLZbvhROU%2BcErQ%40mail.gmail.com.

For more options, visit <a href="https://groups.google.com/d/optout" rel="nofollow" target="_blank" onmousedown="this.href=&#39;https://groups.google.com/d/optout&#39;;return true;" onclick="this.href=&#39;https://groups.google.com/d/optout&#39;;return true;">https://groups.google.com/d/optout.

--
--
jPOS is licensed under AGPL - free for community usage for your open-source project. Licenses are also available for commercial usage. Please support jPOS, contact: [hidden email]
---
You received this message because you are subscribed to the Google Groups "jPOS Users" group.
To unsubscribe from this group and stop receiving emails from it, send an email to jpos-users+...@googlegroups.com.
To post to this group, send email to [hidden email].
To view this discussion on the web visit <a href="https://groups.google.com/d/msgid/jpos-users/CAPazefAHiuwGmsiEH1ROK6KQFNiC%3DobS7NpPmespY8rArwfM0A%40mail.gmail.com?utm_medium=email&amp;utm_source=footer" rel="nofollow" target="_blank" onmousedown="this.href=&#39;https://groups.google.com/d/msgid/jpos-users/CAPazefAHiuwGmsiEH1ROK6KQFNiC%3DobS7NpPmespY8rArwfM0A%40mail.gmail.com?utm_medium\x3demail\x26utm_source\x3dfooter&#39;;return true;" onclick="this.href=&#39;https://groups.google.com/d/msgid/jpos-users/CAPazefAHiuwGmsiEH1ROK6KQFNiC%3DobS7NpPmespY8rArwfM0A%40mail.gmail.com?utm_medium\x3demail\x26utm_source\x3dfooter&#39;;return true;">https://groups.google.com/d/msgid/jpos-users/CAPazefAHiuwGmsiEH1ROK6KQFNiC%3DobS7NpPmespY8rArwfM0A%40mail.gmail.com.

For more options, visit <a href="https://groups.google.com/d/optout" rel="nofollow" target="_blank" onmousedown="this.href=&#39;https://groups.google.com/d/optout&#39;;return true;" onclick="this.href=&#39;https://groups.google.com/d/optout&#39;;return true;">https://groups.google.com/d/optout.

--
--
jPOS is licensed under AGPL - free for community usage for your open-source project. Licenses are also available for commercial usage. Please support jPOS, contact: [hidden email]
---
You received this message because you are subscribed to the Google Groups "jPOS Users" group.
To unsubscribe from this group and stop receiving emails from it, send an email to [hidden email].
To post to this group, send email to [hidden email].
To view this discussion on the web visit https://groups.google.com/d/msgid/jpos-users/db6f0d9f-7633-463d-8356-6b69600ae62b%40googlegroups.com.
For more options, visit https://groups.google.com/d/optout.
Reply | Threaded
Open this post in threaded view
|

Re: [jpos-users] jposee : gradle install error

Alejandro Revilla
In reply to this post by Janta Darbar
Hi Jantar,

Thank you very much for this test. 

Are you positive you need both properties to be true in order to get this working on Windows?



On Sat, May 6, 2017 at 1:50 AM, Janta Darbar <[hidden email]> wrote:
I changed the boolean values to "true"  in following lines in "modules\qi-core\build.gradle"  file : 

manageDependencies = true
vaadinCompile.gwtSdkFirstInClasspath=true

Now, the jposee 'gradle build'  in Windows environment is successful.

Kind regards,
Raj


On Tuesday, May 2, 2017 at 2:40:34 PM UTC-5, Alejandro Revilla wrote:
Dave was kind enough to provide a fix for the BinLog issue and it now builds OK in Windows (https://github.com/jpos/jPOS/pull/128).

The GWT issue doesn't show up in Jenkins/Windows so it must be something else.




On Sat, Apr 29, 2017 at 2:11 AM, chhil <[hidden email]> wrote:

I reached Sep 24 2016

​(sha 
6dba6c83c867b207123b28a052d53fe6188ae934
​)​

and could not build

​ (on Win10 Java 8)​
, though the build error was

Unexpected internal compiler error
java.lang.IncompatibleClassChangeError: class com.google.gwt.dev.javac.asm.CollectMethodData has interface org.objectweb.asm.MethodVisitor as super class
at java.lang.ClassLoader.defineClass1(Native Method)
at java.lang.ClassLoader.defineClass(ClassLoader.java:760)
at java.security.SecureClassLoader.defineClass(SecureClassLoader.java:142)
at java.net.URLClassLoader.defineClass(URLClassLoader.java:467)
at java.net.URLClassLoader.access$100(URLClassLoader.java:73)
...
...
:modules:qi-core:vaadinCompile FAILED
-chhil​





On Sat, Apr 29, 2017 at 10:03 AM, Barzilai Spinak <[hidden email]> wrote:
can anyone do a git bisect and find out which commit introduced the error?


On Friday, April 28, 2017, chhil <[hidden email]> wrote:


unzipped on win10 to C:\Temp\jPOS-EE-master and 

ran gradlew.bat ran gradlew install

got the error as seen by users in the thread.

Then used the same location as a mounted volume in my local docker image jpos/ubuntu_vivid_jdk8_unlimited 

docker run -t -i -v C:\Temp\jPOS-EE-master:/opt/jposee jpos/ubuntu_vivid_jdk8_unlimited

​​
ran ./gradlew ran ./gradlew install

Build generated.

-chhil  

On Fri, Apr 28, 2017 at 5:14 AM, adhi nugroho <[hidden email]> wrote:
yes..i have a same problem with that on windows 10 

Unexpected internal compiler error
java
.lang.RuntimeException: Unexpectedly unable to access Enum.createValueOfMap via reflection. Likely a dependency on the com.google.gwt.user.User module is missing.
at com
.google.gwt.dev.jjs.impl.GwtAstBuilder$AstVisitor.writeEnumValueOfMethod(GwtAstBuilder.java:2793)
at com
.google.gwt.dev.jjs.impl.GwtAstBuilder$AstVisitor.processEnumType(GwtAstBuilder.java:2425)
at com
.google.gwt.dev.jjs.impl.GwtAstBuilder$AstVisitor.endVisit(GwtAstBuilder.java:1861)
at com
.google.gwt.dev.jjs.impl.GwtAstBuilder$AstVisitor.endVisit(GwtAstBuilder.java:1588)
at org
.eclipse.jdt.internal.compiler.ast.TypeDeclaration.traverse(TypeDeclaration.java:1382)
at com
.google.gwt.dev.jjs.impl.GwtAstBuilder.process(GwtAstBuilder.java:3058)
at com
.google.gwt.dev.javac.CompilationStateBuilder$CompileMoreLater$UnitProcessorImpl.process(CompilationStateBuilder.java:141)


On Friday, April 28, 2017 at 5:23:58 AM UTC+7, Janta Darbar wrote:
Can anybody please confirm if they have installed latest JPosEE master in their windows machine?

-Raj



On Wednesday, April 26, 2017 at 9:08:17 PM UTC-5, Janta Darbar wrote:
my laptop is windows 10.

I downloaded the JPosEE Master and tried to Gradle install.

I am using gradle 3.5
java JDK : 1.8.0_121

>gradle install

It is throwing error as follows:

:modules:qi-core:vaadinCompile
Unexpected internal compiler error
java.lang.RuntimeException: Unexpectedly unable to access Enum.createValueOfMap via reflection. Likely a dependency on the com.google.gwt.user.User module is missing.
at com.google.gwt.dev.jjs.impl.GwtAstBuilder$AstVisitor.writeEnumValueOfMethod(GwtAstBuilder.java:2793)
at com.google.gwt.dev.jjs.impl.GwtAstBuilder$AstVisitor.processEnumType(GwtAstBuilder.java:2425)
at com.google.gwt.dev.jjs.impl.GwtAstBuilder$AstVisitor.endVisit(GwtAstBuilder.java:1861)
at com.google.gwt.dev.jjs.impl.GwtAstBuilder$AstVisitor.endVisit(GwtAstBuilder.java:1588)
at org.eclipse.jdt.internal.compiler.ast.TypeDeclaration.traverse(TypeDeclaration.java:1382)
at com.google.gwt.dev.jjs.impl.GwtAstBuilder.process(GwtAstBuilder.java:3058)
at com.google.gwt.dev.javac.CompilationStateBuilder$CompileMoreLater$UnitProcessorImpl.process(CompilationStateBuilder.java:141)
at com.google.gwt.dev.javac.JdtCompiler$CompilerImpl.process(JdtCompiler.java:384)
at org.eclipse.jdt.internal.compiler.Compiler.compile(Compiler.java:470)
at com.google.gwt.dev.javac.JdtCompiler.doCompile(JdtCompiler.java:985)
at com.google.gwt.dev.javac.CompilationStateBuilder$CompileMoreLater.compile(CompilationStateBuilder.java:339)
at com.google.gwt.dev.javac.CompilationStateBuilder.doBuildFrom(CompilationStateBuilder.java:580)
at com.google.gwt.dev.javac.CompilationStateBuilder.buildFrom(CompilationStateBuilder.java:513)
at com.google.gwt.dev.javac.CompilationStateBuilder.buildFrom(CompilationStateBuilder.java:499)
at com.google.gwt.dev.cfg.ModuleDef.getCompilationState(ModuleDef.java:668)
at com.google.gwt.dev.Precompile.precompile(Precompile.java:255)
at com.google.gwt.dev.Precompile.precompile(Precompile.java:229)
at com.google.gwt.dev.Precompile.precompile(Precompile.java:145)
at com.google.gwt.dev.Compiler.run(Compiler.java:206)
at com.google.gwt.dev.Compiler.run(Compiler.java:158)
at com.google.gwt.dev.Compiler$1.run(Compiler.java:120)
at com.google.gwt.dev.CompileTaskRunner.doRun(CompileTaskRunner.java:55)
at com.google.gwt.dev.CompileTaskRunner.runWithAppropriateLogger(CompileTaskRunner.java:50)
at com.google.gwt.dev.Compiler.main(Compiler.java:127)
:modules:qi-core:vaadinCompile FAILED

FAILURE: Build failed with an exception.

* What went wrong:
Execution failed for task ':modules:qi-core:vaadinCompile'.
> Widgetset failed to compile. See error log.


Am I missing anything??

- Rajesh

--
--
jPOS is licensed under AGPL - free for community usage for your open-source project. Licenses are also available for commercial usage. Please support jPOS, contact: [hidden email]
---
You received this message because you are subscribed to the Google Groups "jPOS Users" group.
To unsubscribe from this group and stop receiving emails from it, send an email to jpos-users+unsubscribe@googlegroups.com.
To post to this group, send email to [hidden email].
To view this discussion on the web visit https://groups.google.com/d/msgid/jpos-users/3c01d42c-0a03-4dd5-8ed4-bbf4eafcf96d%40googlegroups.com.

For more options, visit https://groups.google.com/d/optout.

--
--
jPOS is licensed under AGPL - free for community usage for your open-source project. Licenses are also available for commercial usage. Please support jPOS, contact: [hidden email]
---
You received this message because you are subscribed to the Google Groups "jPOS Users" group.
To unsubscribe from this group and stop receiving emails from it, send an email to jpos-users+unsubscribe@googlegroups.com.
To post to this group, send email to [hidden email].
To view this discussion on the web visit https://groups.google.com/d/msgid/jpos-users/CAPazefAjVkfx7qD6iP300UC3fkm_n60aKcznZnVvDd%2B9Zvff%3Dg%40mail.gmail.com.
For more options, visit https://groups.google.com/d/optout.


--
Barzilai Spinak
Transactility, Inc.
www.transactility.com
"Commercial licensing and support for the jPOS.org project"

--
--
jPOS is licensed under AGPL - free for community usage for your open-source project. Licenses are also available for commercial usage. Please support jPOS, contact: [hidden email]
---
You received this message because you are subscribed to the Google Groups "jPOS Users" group.
To unsubscribe from this group and stop receiving emails from it, send an email to jpos-users+...@googlegroups.com.
To post to this group, send email to [hidden email].
To view this discussion on the web visit https://groups.google.com/d/msgid/jpos-users/CAMUbAtzBtWE%2BEDYSYrwDc6UefkhSF3BePP04HLZbvhROU%2BcErQ%40mail.gmail.com.

For more options, visit https://groups.google.com/d/optout.

--
--
jPOS is licensed under AGPL - free for community usage for your open-source project. Licenses are also available for commercial usage. Please support jPOS, contact: [hidden email]
---
You received this message because you are subscribed to the Google Groups "jPOS Users" group.
To unsubscribe from this group and stop receiving emails from it, send an email to jpos-users+...@googlegroups.com.
To post to this group, send email to [hidden email].
To view this discussion on the web visit https://groups.google.com/d/msgid/jpos-users/CAPazefAHiuwGmsiEH1ROK6KQFNiC%3DobS7NpPmespY8rArwfM0A%40mail.gmail.com.

For more options, visit https://groups.google.com/d/optout.

--
--
jPOS is licensed under AGPL - free for community usage for your open-source project. Licenses are also available for commercial usage. Please support jPOS, contact: [hidden email]
---
You received this message because you are subscribed to the Google Groups "jPOS Users" group.
To unsubscribe from this group and stop receiving emails from it, send an email to [hidden email].
To post to this group, send email to [hidden email].
To view this discussion on the web visit https://groups.google.com/d/msgid/jpos-users/ec7c6821-c283-4c85-ba0b-876bae1d3c18%40googlegroups.com.
For more options, visit https://groups.google.com/d/optout.

--
--
jPOS is licensed under AGPL - free for community usage for your open-source project. Licenses are also available for commercial usage. Please support jPOS, contact: [hidden email]
---
You received this message because you are subscribed to the Google Groups "jPOS Users" group.
To unsubscribe from this group and stop receiving emails from it, send an email to [hidden email].
To post to this group, send email to [hidden email].
To view this discussion on the web visit https://groups.google.com/d/msgid/jpos-users/CAAgSK%3Dmo2PPpw%3DhvxMyO8ahtW37kso1iTp6GbZvL-YkZYMeh%2BQ%40mail.gmail.com.
For more options, visit https://groups.google.com/d/optout.
Reply | Threaded
Open this post in threaded view
|

Re: [jpos-users] jposee : gradle install error

Janta Darbar
Hi Alejjandro,

Thanks. I tried few combinations to arrive at this conclusion. 

Others may try in their windows setup and confirm.





On Saturday, May 6, 2017 at 5:39:03 PM UTC-5, Alejandro Revilla wrote:
Hi Jantar,

Thank you very much for this test. 

Are you positive you need both properties to be true in order to get this working on Windows?


--
<a style="font-family:garamond,serif" href="http://twitter.com/apr" target="_blank" rel="nofollow" onmousedown="this.href=&#39;http://www.google.com/url?q\x3dhttp%3A%2F%2Ftwitter.com%2Fapr\x26sa\x3dD\x26sntz\x3d1\x26usg\x3dAFQjCNFRt8creb486OVHOJ12erdzV1NRIg&#39;;return true;" onclick="this.href=&#39;http://www.google.com/url?q\x3dhttp%3A%2F%2Ftwitter.com%2Fapr\x26sa\x3dD\x26sntz\x3d1\x26usg\x3dAFQjCNFRt8creb486OVHOJ12erdzV1NRIg&#39;;return true;">@apr

On Sat, May 6, 2017 at 1:50 AM, Janta Darbar <<a href="javascript:" target="_blank" gdf-obfuscated-mailto="aJAXzhdxAQAJ" rel="nofollow" onmousedown="this.href=&#39;javascript:&#39;;return true;" onclick="this.href=&#39;javascript:&#39;;return true;">dilli...@...> wrote:
I changed the boolean values to "true"  in following lines in "modules\qi-core\build.gradle"  file : 

manageDependencies = true
vaadinCompile.gwtSdkFirstInClasspath=true

Now, the jposee 'gradle build'  in Windows environment is successful.

Kind regards,
Raj


On Tuesday, May 2, 2017 at 2:40:34 PM UTC-5, Alejandro Revilla wrote:
Dave was kind enough to provide a fix for the BinLog issue and it now builds OK in Windows (<a href="https://github.com/jpos/jPOS/pull/128" rel="nofollow" target="_blank" onmousedown="this.href=&#39;https://www.google.com/url?q\x3dhttps%3A%2F%2Fgithub.com%2Fjpos%2FjPOS%2Fpull%2F128\x26sa\x3dD\x26sntz\x3d1\x26usg\x3dAFQjCNGpjYmL4HnGV6519l1BWO9gIpWVOw&#39;;return true;" onclick="this.href=&#39;https://www.google.com/url?q\x3dhttps%3A%2F%2Fgithub.com%2Fjpos%2FjPOS%2Fpull%2F128\x26sa\x3dD\x26sntz\x3d1\x26usg\x3dAFQjCNGpjYmL4HnGV6519l1BWO9gIpWVOw&#39;;return true;">https://github.com/jpos/jPOS/pull/128).

The GWT issue doesn't show up in Jenkins/Windows so it must be something else.



--
<a style="font-family:garamond,serif" href="http://twitter.com/apr" rel="nofollow" target="_blank" onmousedown="this.href=&#39;http://www.google.com/url?q\x3dhttp%3A%2F%2Ftwitter.com%2Fapr\x26sa\x3dD\x26sntz\x3d1\x26usg\x3dAFQjCNFRt8creb486OVHOJ12erdzV1NRIg&#39;;return true;" onclick="this.href=&#39;http://www.google.com/url?q\x3dhttp%3A%2F%2Ftwitter.com%2Fapr\x26sa\x3dD\x26sntz\x3d1\x26usg\x3dAFQjCNFRt8creb486OVHOJ12erdzV1NRIg&#39;;return true;">@apr

On Sat, Apr 29, 2017 at 2:11 AM, chhil <[hidden email]> wrote:
I tried getting various zips for build till <a href="https://github.com/jpos/jPOS-EE/tree/6dba6c83c867b207123b28a052d53fe6188ae934" rel="nofollow" target="_blank" onmousedown="this.href=&#39;https://www.google.com/url?q\x3dhttps%3A%2F%2Fgithub.com%2Fjpos%2FjPOS-EE%2Ftree%2F6dba6c83c867b207123b28a052d53fe6188ae934\x26sa\x3dD\x26sntz\x3d1\x26usg\x3dAFQjCNFTXyZrCxDBexkGhdoxgV1p5yP0hw&#39;;return true;" onclick="this.href=&#39;https://www.google.com/url?q\x3dhttps%3A%2F%2Fgithub.com%2Fjpos%2FjPOS-EE%2Ftree%2F6dba6c83c867b207123b28a052d53fe6188ae934\x26sa\x3dD\x26sntz\x3d1\x26usg\x3dAFQjCNFTXyZrCxDBexkGhdoxgV1p5yP0hw&#39;;return true;">https://github.com/jpos/jPOS-EE/tree/6dba6c83c867b207123b28a052d53fe6188ae934

I reached Sep 24 2016

​(sha 
6dba6c83c867b207123b28a052d53fe6188ae934
​)​

and could not build

​ (on Win10 Java 8)​
, though the build error was

Unexpected internal compiler error
java.lang.IncompatibleClassChangeError: class com.google.gwt.dev.javac.asm.CollectMethodData has interface org.objectweb.asm.MethodVisitor as super class
at java.lang.ClassLoader.defineClass1(Native Method)
at java.lang.ClassLoader.defineClass(ClassLoader.java:760)
at java.security.SecureClassLoader.defineClass(SecureClassLoader.java:142)
at java.net.URLClassLoader.defineClass(URLClassLoader.java:467)
at java.net.URLClassLoader.access$100(URLClassLoader.java:73)
...
...
:modules:qi-core:vaadinCompile FAILED
-chhil​





On Sat, Apr 29, 2017 at 10:03 AM, Barzilai Spinak <[hidden email]> wrote:
can anyone do a git bisect and find out which commit introduced the error?


On Friday, April 28, 2017, chhil <[hidden email]> wrote:

Got the zip via <a href="https://github.com/jpos/jPOS-EE/archive/master.zip" rel="nofollow" target="_blank" onmousedown="this.href=&#39;https://www.google.com/url?q\x3dhttps%3A%2F%2Fgithub.com%2Fjpos%2FjPOS-EE%2Farchive%2Fmaster.zip\x26sa\x3dD\x26sntz\x3d1\x26usg\x3dAFQjCNFSTIIJ3X5bIqb_PSkmk6HaZphGIQ&#39;;return true;" onclick="this.href=&#39;https://www.google.com/url?q\x3dhttps%3A%2F%2Fgithub.com%2Fjpos%2FjPOS-EE%2Farchive%2Fmaster.zip\x26sa\x3dD\x26sntz\x3d1\x26usg\x3dAFQjCNFSTIIJ3X5bIqb_PSkmk6HaZphGIQ&#39;;return true;">https://github.com/jpos/jPOS-EE/archive/master.zip

unzipped on win10 to C:\Temp\jPOS-EE-master and 

ran gradlew.bat ran gradlew install

got the error as seen by users in the thread.

Then used the same location as a mounted volume in my local docker image jpos/ubuntu_vivid_jdk8_unlimited 

docker run -t -i -v C:\Temp\jPOS-EE-master:/opt/jposee jpos/ubuntu_vivid_jdk8_unlimited

​​
ran ./gradlew ran ./gradlew install

Build generated.

-chhil  

On Fri, Apr 28, 2017 at 5:14 AM, adhi nugroho <[hidden email]> wrote:
yes..i have a same problem with that on windows 10 

Unexpected internal compiler error
java
.lang.RuntimeException: Unexpectedly unable to access Enum.createValueOfMap via reflection. Likely a dependency on the com.google.gwt.user.User module is missing.
at com
.google.gwt.dev.jjs.impl.GwtAstBuilder$AstVisitor.writeEnumValueOfMethod(GwtAstBuilder.java:2793)
at com
.google.gwt.dev.jjs.impl.GwtAstBuilder$AstVisitor.processEnumType(GwtAstBuilder.java:2425)
at com
.google.gwt.dev.jjs.impl.GwtAstBuilder$AstVisitor.endVisit(GwtAstBuilder.java:1861)
at com
.google.gwt.dev.jjs.impl.GwtAstBuilder$AstVisitor.endVisit(GwtAstBuilder.java:1588)
at org
.eclipse.jdt.internal.compiler.ast.TypeDeclaration.traverse(TypeDeclaration.java:1382)
at com
.google.gwt.dev.jjs.impl.GwtAstBuilder.process(GwtAstBuilder.java:3058)
at com
.google.gwt.dev.javac.CompilationStateBuilder$CompileMoreLater$UnitProcessorImpl.process(CompilationStateBuilder.java:141)


On Friday, April 28, 2017 at 5:23:58 AM UTC+7, Janta Darbar wrote:
Can anybody please confirm if they have installed latest JPosEE master in their windows machine?

-Raj



On Wednesday, April 26, 2017 at 9:08:17 PM UTC-5, Janta Darbar wrote:
my laptop is windows 10.

I downloaded the JPosEE Master and tried to Gradle install.

I am using gradle 3.5
java JDK : 1.8.0_121

>gradle install

It is throwing error as follows:

:modules:qi-core:vaadinCompile
Unexpected internal compiler error
java.lang.RuntimeException: Unexpectedly unable to access Enum.createValueOfMap via reflection. Likely a dependency on the com.google.gwt.user.User module is missing.
at <a href="http://com.google.gwt.dev.jjs.impl.Gw" rel="nofollow" target="_blank" onmousedown="this.href=&#39;http://www.google.com/url?q\x3dhttp%3A%2F%2Fcom.google.gwt.dev.jjs.impl.Gw\x26sa\x3dD\x26sntz\x3d1\x26usg\x3dAFQjCNGvRJR19AQt0TfIqvq7txcCEfSF0g&#39;;return true;" onclick="this.href=&#39;http://www.google.com/url?q\x3dhttp%3A%2F%2Fcom.google.gwt.dev.jjs.impl.Gw\x26sa\x3dD\x26sntz\x3d1\x26usg\x3dAFQjCNGvRJR19AQt0TfIqvq7txcCEfSF0g&#39;;return true;">com.google.gwt.dev.jjs.impl.GwtAstBuilder$AstVisitor.writeEnumValueOfMethod(GwtAstBuilder.java:2793)
at <a href="http://com.google.gwt.dev.jjs.impl.Gw" rel="nofollow" target="_blank" onmousedown="this.href=&#39;http://www.google.com/url?q\x3dhttp%3A%2F%2Fcom.google.gwt.dev.jjs.impl.Gw\x26sa\x3dD\x26sntz\x3d1\x26usg\x3dAFQjCNGvRJR19AQt0TfIqvq7txcCEfSF0g&#39;;return true;" onclick="this.href=&#39;http://www.google.com/url?q\x3dhttp%3A%2F%2Fcom.google.gwt.dev.jjs.impl.Gw\x26sa\x3dD\x26sntz\x3d1\x26usg\x3dAFQjCNGvRJR19AQt0TfIqvq7txcCEfSF0g&#39;;return true;">com.google.gwt.dev.jjs.impl.GwtAstBuilder$AstVisitor.processEnumType(GwtAstBuilder.java:2425)
at <a href="http://com.google.gwt.dev.jjs.impl.Gw" rel="nofollow" target="_blank" onmousedown="this.href=&#39;http://www.google.com/url?q\x3dhttp%3A%2F%2Fcom.google.gwt.dev.jjs.impl.Gw\x26sa\x3dD\x26sntz\x3d1\x26usg\x3dAFQjCNGvRJR19AQt0TfIqvq7txcCEfSF0g&#39;;return true;" onclick="this.href=&#39;http://www.google.com/url?q\x3dhttp%3A%2F%2Fcom.google.gwt.dev.jjs.impl.Gw\x26sa\x3dD\x26sntz\x3d1\x26usg\x3dAFQjCNGvRJR19AQt0TfIqvq7txcCEfSF0g&#39;;return true;">com.google.gwt.dev.jjs.impl.GwtAstBuilder$AstVisitor.endVisit(GwtAstBuilder.java:1861)
at <a href="http://com.google.gwt.dev.jjs.impl.Gw" rel="nofollow" target="_blank" onmousedown="this.href=&#39;http://www.google.com/url?q\x3dhttp%3A%2F%2Fcom.google.gwt.dev.jjs.impl.Gw\x26sa\x3dD\x26sntz\x3d1\x26usg\x3dAFQjCNGvRJR19AQt0TfIqvq7txcCEfSF0g&#39;;return true;" onclick="this.href=&#39;http://www.google.com/url?q\x3dhttp%3A%2F%2Fcom.google.gwt.dev.jjs.impl.Gw\x26sa\x3dD\x26sntz\x3d1\x26usg\x3dAFQjCNGvRJR19AQt0TfIqvq7txcCEfSF0g&#39;;return true;">com.google.gwt.dev.jjs.impl.GwtAstBuilder$AstVisitor.endVisit(GwtAstBuilder.java:1588)
at org.eclipse.jdt.internal.compiler.ast.TypeDeclaration.traverse(TypeDeclaration.java:1382)
at <a href="http://com.google.gwt.dev.jjs.impl.Gw" rel="nofollow" target="_blank" onmousedown="this.href=&#39;http://www.google.com/url?q\x3dhttp%3A%2F%2Fcom.google.gwt.dev.jjs.impl.Gw\x26sa\x3dD\x26sntz\x3d1\x26usg\x3dAFQjCNGvRJR19AQt0TfIqvq7txcCEfSF0g&#39;;return true;" onclick="this.href=&#39;http://www.google.com/url?q\x3dhttp%3A%2F%2Fcom.google.gwt.dev.jjs.impl.Gw\x26sa\x3dD\x26sntz\x3d1\x26usg\x3dAFQjCNGvRJR19AQt0TfIqvq7txcCEfSF0g&#39;;return true;">com.google.gwt.dev.jjs.impl.GwtAstBuilder.process(GwtAstBuilder.java:3058)
at com.google.gwt.dev.javac.CompilationStateBuilder$CompileMoreLater$UnitProcessorImpl.process(CompilationStateBuilder.java:141)
at com.google.gwt.dev.javac.JdtCompiler$CompilerImpl.process(JdtCompiler.java:384)
at org.eclipse.jdt.internal.compiler.Compiler.compile(Compiler.java:470)
at com.google.gwt.dev.javac.JdtCompiler.doCompile(JdtCompiler.java:985)
at com.google.gwt.dev.javac.CompilationStateBuilder$CompileMoreLater.compile(CompilationStateBuilder.java:339)
at com.google.gwt.dev.javac.CompilationStateBuilder.doBuildFrom(CompilationStateBuilder.java:580)
at com.google.gwt.dev.javac.CompilationStateBuilder.buildFrom(CompilationStateBuilder.java:513)
at com.google.gwt.dev.javac.CompilationStateBuilder.buildFrom(CompilationStateBuilder.java:499)
at com.google.gwt.dev.cfg.ModuleDef.getCompilationState(ModuleDef.java:668)
at com.google.gwt.dev.Precompile.precompile(Precompile.java:255)
at com.google.gwt.dev.Precompile.precompile(Precompile.java:229)
at com.google.gwt.dev.Precompile.precompile(Precompile.java:145)
at <a href="http://com.google.gwt.dev.Compiler.ru" rel="nofollow" target="_blank" onmousedown="this.href=&#39;http://www.google.com/url?q\x3dhttp%3A%2F%2Fcom.google.gwt.dev.Compiler.ru\x26sa\x3dD\x26sntz\x3d1\x26usg\x3dAFQjCNFXMquzc8TxB0aHR83Q3A5h350ARA&#39;;return true;" onclick="this.href=&#39;http://www.google.com/url?q\x3dhttp%3A%2F%2Fcom.google.gwt.dev.Compiler.ru\x26sa\x3dD\x26sntz\x3d1\x26usg\x3dAFQjCNFXMquzc8TxB0aHR83Q3A5h350ARA&#39;;return true;">com.google.gwt.dev.Compiler.run(Compiler.java:206)
at <a href="http://com.google.gwt.dev.Compiler.ru" rel="nofollow" target="_blank" onmousedown="this.href=&#39;http://www.google.com/url?q\x3dhttp%3A%2F%2Fcom.google.gwt.dev.Compiler.ru\x26sa\x3dD\x26sntz\x3d1\x26usg\x3dAFQjCNFXMquzc8TxB0aHR83Q3A5h350ARA&#39;;return true;" onclick="this.href=&#39;http://www.google.com/url?q\x3dhttp%3A%2F%2Fcom.google.gwt.dev.Compiler.ru\x26sa\x3dD\x26sntz\x3d1\x26usg\x3dAFQjCNFXMquzc8TxB0aHR83Q3A5h350ARA&#39;;return true;">com.google.gwt.dev.Compiler.run(Compiler.java:158)
at com.google.gwt.dev.Compiler$1.run(Compiler.java:120)
at com.google.gwt.dev.CompileTaskRunner.doRun(CompileTaskRunner.java:55)
at com.google.gwt.dev.CompileTaskRunner.runWithAppropriateLogger(CompileTaskRunner.java:50)
at <a href="http://com.google.gwt.dev.Compiler.ma" rel="nofollow" target="_blank" onmousedown="this.href=&#39;http://www.google.com/url?q\x3dhttp%3A%2F%2Fcom.google.gwt.dev.Compiler.ma\x26sa\x3dD\x26sntz\x3d1\x26usg\x3dAFQjCNE26rMIDLoGeU5tDGPG7zFu_NzTZQ&#39;;return true;" onclick="this.href=&#39;http://www.google.com/url?q\x3dhttp%3A%2F%2Fcom.google.gwt.dev.Compiler.ma\x26sa\x3dD\x26sntz\x3d1\x26usg\x3dAFQjCNE26rMIDLoGeU5tDGPG7zFu_NzTZQ&#39;;return true;">com.google.gwt.dev.Compiler.main(Compiler.java:127)
:modules:qi-core:vaadinCompile FAILED

FAILURE: Build failed with an exception.

* What went wrong:
Execution failed for task ':modules:qi-core:vaadinCompile'.
> Widgetset failed to compile. See error log.


Am I missing anything??

- Rajesh

--
--
jPOS is licensed under AGPL - free for community usage for your open-source project. Licenses are also available for commercial usage. Please support jPOS, contact: [hidden email]
---
You received this message because you are subscribed to the Google Groups "jPOS Users" group.
To unsubscribe from this group and stop receiving emails from it, send an email to jpos-users+unsubscribe@googlegroups.com.
To post to this group, send email to [hidden email].
To view this discussion on the web visit <a href="https://groups.google.com/d/msgid/jpos-users/3c01d42c-0a03-4dd5-8ed4-bbf4eafcf96d%40googlegroups.com?utm_medium=email&amp;utm_source=footer" rel="nofollow" target="_blank" onmousedown="this.href=&#39;https://groups.google.com/d/msgid/jpos-users/3c01d42c-0a03-4dd5-8ed4-bbf4eafcf96d%40googlegroups.com?utm_medium\x3demail\x26utm_source\x3dfooter&#39;;return true;" onclick="this.href=&#39;https://groups.google.com/d/msgid/jpos-users/3c01d42c-0a03-4dd5-8ed4-bbf4eafcf96d%40googlegroups.com?utm_medium\x3demail\x26utm_source\x3dfooter&#39;;return true;">https://groups.google.com/d/msgid/jpos-users/3c01d42c-0a03-4dd5-8ed4-bbf4eafcf96d%40googlegroups.com.

For more options, visit <a href="https://groups.google.com/d/optout" rel="nofollow" target="_blank" onmousedown="this.href=&#39;https://groups.google.com/d/optout&#39;;return true;" onclick="this.href=&#39;https://groups.google.com/d/optout&#39;;return true;">https://groups.google.com/d/optout.

--
--
jPOS is licensed under AGPL - free for community usage for your open-source project. Licenses are also available for commercial usage. Please support jPOS, contact: [hidden email]
---
You received this message because you are subscribed to the Google Groups "jPOS Users" group.
To unsubscribe from this group and stop receiving emails from it, send an email to jpos-users+unsubscribe@googlegroups.com.
To post to this group, send email to [hidden email].
To view this discussion on the web visit <a href="https://groups.google.com/d/msgid/jpos-users/CAPazefAjVkfx7qD6iP300UC3fkm_n60aKcznZnVvDd%2B9Zvff%3Dg%40mail.gmail.com?utm_medium=email&amp;utm_source=footer" rel="nofollow" target="_blank" onmousedown="this.href=&#39;https://groups.google.com/d/msgid/jpos-users/CAPazefAjVkfx7qD6iP300UC3fkm_n60aKcznZnVvDd%2B9Zvff%3Dg%40mail.gmail.com?utm_medium\x3demail\x26utm_source\x3dfooter&#39;;return true;" onclick="this.href=&#39;https://groups.google.com/d/msgid/jpos-users/CAPazefAjVkfx7qD6iP300UC3fkm_n60aKcznZnVvDd%2B9Zvff%3Dg%40mail.gmail.com?utm_medium\x3demail\x26utm_source\x3dfooter&#39;;return true;">https://groups.google.com/d/msgid/jpos-users/CAPazefAjVkfx7qD6iP300UC3fkm_n60aKcznZnVvDd%2B9Zvff%3Dg%40mail.gmail.com.
For more options, visit <a href="https://groups.google.com/d/optout" rel="nofollow" target="_blank" onmousedown="this.href=&#39;https://groups.google.com/d/optout&#39;;return true;" onclick="this.href=&#39;https://groups.google.com/d/optout&#39;;return true;">https://groups.google.com/d/optout.


--
Barzilai Spinak
Transactility, Inc.
<a href="http://www.transactility.com" rel="nofollow" target="_blank" onmousedown="this.href=&#39;http://www.google.com/url?q\x3dhttp%3A%2F%2Fwww.transactility.com\x26sa\x3dD\x26sntz\x3d1\x26usg\x3dAFQjCNH2Sie_sItmzefqi-CBIeBxkqnuwQ&#39;;return true;" onclick="this.href=&#39;http://www.google.com/url?q\x3dhttp%3A%2F%2Fwww.transactility.com\x26sa\x3dD\x26sntz\x3d1\x26usg\x3dAFQjCNH2Sie_sItmzefqi-CBIeBxkqnuwQ&#39;;return true;">www.transactility.com
"Commercial licensing and support for the jPOS.org project"

--
--
jPOS is licensed under AGPL - free for community usage for your open-source project. Licenses are also available for commercial usage. Please support jPOS, contact: [hidden email]
---
You received this message because you are subscribed to the Google Groups "jPOS Users" group.
To unsubscribe from this group and stop receiving emails from it, send an email to jpos-users+...@googlegroups.com.
To post to this group, send email to [hidden email].
To view this discussion on the web visit <a href="https://groups.google.com/d/msgid/jpos-users/CAMUbAtzBtWE%2BEDYSYrwDc6UefkhSF3BePP04HLZbvhROU%2BcErQ%40mail.gmail.com?utm_medium=email&amp;utm_source=footer" rel="nofollow" target="_blank" onmousedown="this.href=&#39;https://groups.google.com/d/msgid/jpos-users/CAMUbAtzBtWE%2BEDYSYrwDc6UefkhSF3BePP04HLZbvhROU%2BcErQ%40mail.gmail.com?utm_medium\x3demail\x26utm_source\x3dfooter&#39;;return true;" onclick="this.href=&#39;https://groups.google.com/d/msgid/jpos-users/CAMUbAtzBtWE%2BEDYSYrwDc6UefkhSF3BePP04HLZbvhROU%2BcErQ%40mail.gmail.com?utm_medium\x3demail\x26utm_source\x3dfooter&#39;;return true;">https://groups.google.com/d/msgid/jpos-users/CAMUbAtzBtWE%2BEDYSYrwDc6UefkhSF3BePP04HLZbvhROU%2BcErQ%40mail.gmail.com.

For more options, visit <a href="https://groups.google.com/d/optout" rel="nofollow" target="_blank" onmousedown="this.href=&#39;https://groups.google.com/d/optout&#39;;return true;" onclick="this.href=&#39;https://groups.google.com/d/optout&#39;;return true;">https://groups.google.com/d/optout.

--
--
jPOS is licensed under AGPL - free for community usage for your open-source project. Licenses are also available for commercial usage. Please support jPOS, contact: [hidden email]
---
You received this message because you are subscribed to the Google Groups "jPOS Users" group.
To unsubscribe from this group and stop receiving emails from it, send an email to jpos-users+...@googlegroups.com.
To post to this group, send email to [hidden email].
To view this discussion on the web visit <a href="https://groups.google.com/d/msgid/jpos-users/CAPazefAHiuwGmsiEH1ROK6KQFNiC%3DobS7NpPmespY8rArwfM0A%40mail.gmail.com?utm_medium=email&amp;utm_source=footer" rel="nofollow" target="_blank" onmousedown="this.href=&#39;https://groups.google.com/d/msgid/jpos-users/CAPazefAHiuwGmsiEH1ROK6KQFNiC%3DobS7NpPmespY8rArwfM0A%40mail.gmail.com?utm_medium\x3demail\x26utm_source\x3dfooter&#39;;return true;" onclick="this.href=&#39;https://groups.google.com/d/msgid/jpos-users/CAPazefAHiuwGmsiEH1ROK6KQFNiC%3DobS7NpPmespY8rArwfM0A%40mail.gmail.com?utm_medium\x3demail\x26utm_source\x3dfooter&#39;;return true;">https://groups.google.com/d/msgid/jpos-users/CAPazefAHiuwGmsiEH1ROK6KQFNiC%3DobS7NpPmespY8rArwfM0A%40mail.gmail.com.

For more options, visit <a href="https://groups.google.com/d/optout" rel="nofollow" target="_blank" onmousedown="this.href=&#39;https://groups.google.com/d/optout&#39;;return true;" onclick="this.href=&#39;https://groups.google.com/d/optout&#39;;return true;">https://groups.google.com/d/optout.

--
--
jPOS is licensed under AGPL - free for community usage for your open-source project. Licenses are also available for commercial usage. Please support jPOS, contact: <a href="javascript:" target="_blank" gdf-obfuscated-mailto="aJAXzhdxAQAJ" rel="nofollow" onmousedown="this.href=&#39;javascript:&#39;;return true;" onclick="this.href=&#39;javascript:&#39;;return true;">sa...@...
---
You received this message because you are subscribed to the Google Groups "jPOS Users" group.
To unsubscribe from this group and stop receiving emails from it, send an email to <a href="javascript:" target="_blank" gdf-obfuscated-mailto="aJAXzhdxAQAJ" rel="nofollow" onmousedown="this.href=&#39;javascript:&#39;;return true;" onclick="this.href=&#39;javascript:&#39;;return true;">jpos-users+...@googlegroups.com.
To post to this group, send email to <a href="javascript:" target="_blank" gdf-obfuscated-mailto="aJAXzhdxAQAJ" rel="nofollow" onmousedown="this.href=&#39;javascript:&#39;;return true;" onclick="this.href=&#39;javascript:&#39;;return true;">jpos-...@....
To view this discussion on the web visit <a href="https://groups.google.com/d/msgid/jpos-users/ec7c6821-c283-4c85-ba0b-876bae1d3c18%40googlegroups.com?utm_medium=email&amp;utm_source=footer" target="_blank" rel="nofollow" onmousedown="this.href=&#39;https://groups.google.com/d/msgid/jpos-users/ec7c6821-c283-4c85-ba0b-876bae1d3c18%40googlegroups.com?utm_medium\x3demail\x26utm_source\x3dfooter&#39;;return true;" onclick="this.href=&#39;https://groups.google.com/d/msgid/jpos-users/ec7c6821-c283-4c85-ba0b-876bae1d3c18%40googlegroups.com?utm_medium\x3demail\x26utm_source\x3dfooter&#39;;return true;">https://groups.google.com/d/msgid/jpos-users/ec7c6821-c283-4c85-ba0b-876bae1d3c18%40googlegroups.com.
For more options, visit <a href="https://groups.google.com/d/optout" target="_blank" rel="nofollow" onmousedown="this.href=&#39;https://groups.google.com/d/optout&#39;;return true;" onclick="this.href=&#39;https://groups.google.com/d/optout&#39;;return true;">https://groups.google.com/d/optout.

--
--
jPOS is licensed under AGPL - free for community usage for your open-source project. Licenses are also available for commercial usage. Please support jPOS, contact: [hidden email]
---
You received this message because you are subscribed to the Google Groups "jPOS Users" group.
To unsubscribe from this group and stop receiving emails from it, send an email to [hidden email].
To post to this group, send email to [hidden email].
To view this discussion on the web visit https://groups.google.com/d/msgid/jpos-users/c2c2f687-845c-4b62-844c-c7f7c39c7799%40googlegroups.com.
For more options, visit https://groups.google.com/d/optout.
Reply | Threaded
Open this post in threaded view
|

Re: [jpos-users] jposee : gradle install error

Alejandro Revilla
Got it. We tested it in Unix and it works, also in the vaadin8 branch, so we went ahead and applied your suggested patch:


Thank you!



On Sun, May 7, 2017 at 7:29 AM, Janta Darbar <[hidden email]> wrote:
Hi Alejjandro,

Thanks. I tried few combinations to arrive at this conclusion. 

Others may try in their windows setup and confirm.





On Saturday, May 6, 2017 at 5:39:03 PM UTC-5, Alejandro Revilla wrote:
Hi Jantar,

Thank you very much for this test. 

Are you positive you need both properties to be true in order to get this working on Windows?



On Sat, May 6, 2017 at 1:50 AM, Janta Darbar <[hidden email]> wrote:
I changed the boolean values to "true"  in following lines in "modules\qi-core\build.gradle"  file : 

manageDependencies = true
vaadinCompile.gwtSdkFirstInClasspath=true

Now, the jposee 'gradle build'  in Windows environment is successful.

Kind regards,
Raj


On Tuesday, May 2, 2017 at 2:40:34 PM UTC-5, Alejandro Revilla wrote:
Dave was kind enough to provide a fix for the BinLog issue and it now builds OK in Windows (https://github.com/jpos/jPOS/pull/128).

The GWT issue doesn't show up in Jenkins/Windows so it must be something else.




On Sat, Apr 29, 2017 at 2:11 AM, chhil <[hidden email]> wrote:

I reached Sep 24 2016

​(sha 
6dba6c83c867b207123b28a052d53fe6188ae934
​)​

and could not build

​ (on Win10 Java 8)​
, though the build error was

Unexpected internal compiler error
java.lang.IncompatibleClassChangeError: class com.google.gwt.dev.javac.asm.CollectMethodData has interface org.objectweb.asm.MethodVisitor as super class
at java.lang.ClassLoader.defineClass1(Native Method)
at java.lang.ClassLoader.defineClass(ClassLoader.java:760)
at java.security.SecureClassLoader.defineClass(SecureClassLoader.java:142)
at java.net.URLClassLoader.defineClass(URLClassLoader.java:467)
at java.net.URLClassLoader.access$100(URLClassLoader.java:73)
...
...
:modules:qi-core:vaadinCompile FAILED
-chhil​





On Sat, Apr 29, 2017 at 10:03 AM, Barzilai Spinak <[hidden email]> wrote:
can anyone do a git bisect and find out which commit introduced the error?


On Friday, April 28, 2017, chhil <[hidden email]> wrote:


unzipped on win10 to C:\Temp\jPOS-EE-master and 

ran gradlew.bat ran gradlew install

got the error as seen by users in the thread.

Then used the same location as a mounted volume in my local docker image jpos/ubuntu_vivid_jdk8_unlimited 

docker run -t -i -v C:\Temp\jPOS-EE-master:/opt/jposee jpos/ubuntu_vivid_jdk8_unlimited

​​
ran ./gradlew ran ./gradlew install

Build generated.

-chhil  

On Fri, Apr 28, 2017 at 5:14 AM, adhi nugroho <[hidden email]> wrote:
yes..i have a same problem with that on windows 10 

Unexpected internal compiler error
java
.lang.RuntimeException: Unexpectedly unable to access Enum.createValueOfMap via reflection. Likely a dependency on the com.google.gwt.user.User module is missing.
at com
.google.gwt.dev.jjs.impl.GwtAstBuilder$AstVisitor.writeEnumValueOfMethod(GwtAstBuilder.java:2793)
at com
.google.gwt.dev.jjs.impl.GwtAstBuilder$AstVisitor.processEnumType(GwtAstBuilder.java:2425)
at com
.google.gwt.dev.jjs.impl.GwtAstBuilder$AstVisitor.endVisit(GwtAstBuilder.java:1861)
at com
.google.gwt.dev.jjs.impl.GwtAstBuilder$AstVisitor.endVisit(GwtAstBuilder.java:1588)
at org
.eclipse.jdt.internal.compiler.ast.TypeDeclaration.traverse(TypeDeclaration.java:1382)
at com
.google.gwt.dev.jjs.impl.GwtAstBuilder.process(GwtAstBuilder.java:3058)
at com
.google.gwt.dev.javac.CompilationStateBuilder$CompileMoreLater$UnitProcessorImpl.process(CompilationStateBuilder.java:141)


On Friday, April 28, 2017 at 5:23:58 AM UTC+7, Janta Darbar wrote:
Can anybody please confirm if they have installed latest JPosEE master in their windows machine?

-Raj



On Wednesday, April 26, 2017 at 9:08:17 PM UTC-5, Janta Darbar wrote:
my laptop is windows 10.

I downloaded the JPosEE Master and tried to Gradle install.

I am using gradle 3.5
java JDK : 1.8.0_121

>gradle install

It is throwing error as follows:

:modules:qi-core:vaadinCompile
Unexpected internal compiler error
java.lang.RuntimeException: Unexpectedly unable to access Enum.createValueOfMap via reflection. Likely a dependency on the com.google.gwt.user.User module is missing.
at com.google.gwt.dev.jjs.impl.GwtAstBuilder$AstVisitor.writeEnumValueOfMethod(GwtAstBuilder.java:2793)
at com.google.gwt.dev.jjs.impl.GwtAstBuilder$AstVisitor.processEnumType(GwtAstBuilder.java:2425)
at com.google.gwt.dev.jjs.impl.GwtAstBuilder$AstVisitor.endVisit(GwtAstBuilder.java:1861)
at com.google.gwt.dev.jjs.impl.GwtAstBuilder$AstVisitor.endVisit(GwtAstBuilder.java:1588)
at org.eclipse.jdt.internal.compiler.ast.TypeDeclaration.traverse(TypeDeclaration.java:1382)
at com.google.gwt.dev.jjs.impl.GwtAstBuilder.process(GwtAstBuilder.java:3058)
at com.google.gwt.dev.javac.CompilationStateBuilder$CompileMoreLater$UnitProcessorImpl.process(CompilationStateBuilder.java:141)
at com.google.gwt.dev.javac.JdtCompiler$CompilerImpl.process(JdtCompiler.java:384)
at org.eclipse.jdt.internal.compiler.Compiler.compile(Compiler.java:470)
at com.google.gwt.dev.javac.JdtCompiler.doCompile(JdtCompiler.java:985)
at com.google.gwt.dev.javac.CompilationStateBuilder$CompileMoreLater.compile(CompilationStateBuilder.java:339)
at com.google.gwt.dev.javac.CompilationStateBuilder.doBuildFrom(CompilationStateBuilder.java:580)
at com.google.gwt.dev.javac.CompilationStateBuilder.buildFrom(CompilationStateBuilder.java:513)
at com.google.gwt.dev.javac.CompilationStateBuilder.buildFrom(CompilationStateBuilder.java:499)
at com.google.gwt.dev.cfg.ModuleDef.getCompilationState(ModuleDef.java:668)
at com.google.gwt.dev.Precompile.precompile(Precompile.java:255)
at com.google.gwt.dev.Precompile.precompile(Precompile.java:229)
at com.google.gwt.dev.Precompile.precompile(Precompile.java:145)
at com.google.gwt.dev.Compiler.run(Compiler.java:206)
at com.google.gwt.dev.Compiler.run(Compiler.java:158)
at com.google.gwt.dev.Compiler$1.run(Compiler.java:120)
at com.google.gwt.dev.CompileTaskRunner.doRun(CompileTaskRunner.java:55)
at com.google.gwt.dev.CompileTaskRunner.runWithAppropriateLogger(CompileTaskRunner.java:50)
at com.google.gwt.dev.Compiler.main(Compiler.java:127)
:modules:qi-core:vaadinCompile FAILED

FAILURE: Build failed with an exception.

* What went wrong:
Execution failed for task ':modules:qi-core:vaadinCompile'.
> Widgetset failed to compile. See error log.


Am I missing anything??

- Rajesh

--
--
jPOS is licensed under AGPL - free for community usage for your open-source project. Licenses are also available for commercial usage. Please support jPOS, contact: [hidden email]
---
You received this message because you are subscribed to the Google Groups "jPOS Users" group.
To unsubscribe from this group and stop receiving emails from it, send an email to jpos-users+unsubscribe@googlegroups.com.
To post to this group, send email to [hidden email].
To view this discussion on the web visit https://groups.google.com/d/msgid/jpos-users/3c01d42c-0a03-4dd5-8ed4-bbf4eafcf96d%40googlegroups.com.

For more options, visit https://groups.google.com/d/optout.

--
--
jPOS is licensed under AGPL - free for community usage for your open-source project. Licenses are also available for commercial usage. Please support jPOS, contact: [hidden email]
---
You received this message because you are subscribed to the Google Groups "jPOS Users" group.
To unsubscribe from this group and stop receiving emails from it, send an email to jpos-users+unsubscribe@googlegroups.com.
To post to this group, send email to [hidden email].
To view this discussion on the web visit https://groups.google.com/d/msgid/jpos-users/CAPazefAjVkfx7qD6iP300UC3fkm_n60aKcznZnVvDd%2B9Zvff%3Dg%40mail.gmail.com.
For more options, visit https://groups.google.com/d/optout.


--
Barzilai Spinak
Transactility, Inc.
www.transactility.com
"Commercial licensing and support for the jPOS.org project"

--
--
jPOS is licensed under AGPL - free for community usage for your open-source project. Licenses are also available for commercial usage. Please support jPOS, contact: [hidden email]
---
You received this message because you are subscribed to the Google Groups "jPOS Users" group.
To unsubscribe from this group and stop receiving emails from it, send an email to [hidden email]m.
To post to this group, send email to [hidden email].
To view this discussion on the web visit https://groups.google.com/d/msgid/jpos-users/CAMUbAtzBtWE%2BEDYSYrwDc6UefkhSF3BePP04HLZbvhROU%2BcErQ%40mail.gmail.com.

For more options, visit https://groups.google.com/d/optout.

--
--
jPOS is licensed under AGPL - free for community usage for your open-source project. Licenses are also available for commercial usage. Please support jPOS, contact: [hidden email]
---
You received this message because you are subscribed to the Google Groups "jPOS Users" group.
To unsubscribe from this group and stop receiving emails from it, send an email to [hidden email]m.
To post to this group, send email to [hidden email].
To view this discussion on the web visit https://groups.google.com/d/msgid/jpos-users/CAPazefAHiuwGmsiEH1ROK6KQFNiC%3DobS7NpPmespY8rArwfM0A%40mail.gmail.com.

For more options, visit https://groups.google.com/d/optout.

--
--
jPOS is licensed under AGPL - free for community usage for your open-source project. Licenses are also available for commercial usage. Please support jPOS, contact: [hidden email]
---
You received this message because you are subscribed to the Google Groups "jPOS Users" group.
To unsubscribe from this group and stop receiving emails from it, send an email to jpos-users+...@googlegroups.com.
To post to this group, send email to [hidden email].
To view this discussion on the web visit https://groups.google.com/d/msgid/jpos-users/ec7c6821-c283-4c85-ba0b-876bae1d3c18%40googlegroups.com.
For more options, visit https://groups.google.com/d/optout.

--
--
jPOS is licensed under AGPL - free for community usage for your open-source project. Licenses are also available for commercial usage. Please support jPOS, contact: [hidden email]
---
You received this message because you are subscribed to the Google Groups "jPOS Users" group.
To unsubscribe from this group and stop receiving emails from it, send an email to [hidden email].
To post to this group, send email to [hidden email].
To view this discussion on the web visit https://groups.google.com/d/msgid/jpos-users/c2c2f687-845c-4b62-844c-c7f7c39c7799%40googlegroups.com.

For more options, visit https://groups.google.com/d/optout.

--
--
jPOS is licensed under AGPL - free for community usage for your open-source project. Licenses are also available for commercial usage. Please support jPOS, contact: [hidden email]
---
You received this message because you are subscribed to the Google Groups "jPOS Users" group.
To unsubscribe from this group and stop receiving emails from it, send an email to [hidden email].
To post to this group, send email to [hidden email].
To view this discussion on the web visit https://groups.google.com/d/msgid/jpos-users/CAAgSK%3Dn6sMv5e8usR8H2XEzp8e3MNfGbGjmZ0m%2B3CvXTpEUCNw%40mail.gmail.com.
For more options, visit https://groups.google.com/d/optout.
Reply | Threaded
Open this post in threaded view
|

Re: [jpos-users] jposee : gradle install error

Janta Darbar
Alejandro,

It's my pleasure. I would be happy to contribute in coming days.

Kind regards

On Tuesday, May 9, 2017 at 7:33:12 PM UTC-5, Alejandro Revilla wrote:
Got it. We tested it in Unix and it works, also in the vaadin8 branch, so we went ahead and applied your suggested patch:

   <a href="https://github.com/jpos/jPOS-EE/commit/05f937e1df02a22de285988f5a953e656ed71d98" target="_blank" rel="nofollow" onmousedown="this.href=&#39;https://www.google.com/url?q\x3dhttps%3A%2F%2Fgithub.com%2Fjpos%2FjPOS-EE%2Fcommit%2F05f937e1df02a22de285988f5a953e656ed71d98\x26sa\x3dD\x26sntz\x3d1\x26usg\x3dAFQjCNGLhg9ggobgDACDmg1TB0Fc7oH07w&#39;;return true;" onclick="this.href=&#39;https://www.google.com/url?q\x3dhttps%3A%2F%2Fgithub.com%2Fjpos%2FjPOS-EE%2Fcommit%2F05f937e1df02a22de285988f5a953e656ed71d98\x26sa\x3dD\x26sntz\x3d1\x26usg\x3dAFQjCNGLhg9ggobgDACDmg1TB0Fc7oH07w&#39;;return true;">https://github.com/jpos/jPOS-EE/commit/05f937e1df02a22de285988f5a953e656ed71d98

Thank you!


--
<a style="font-family:garamond,serif" href="http://twitter.com/apr" target="_blank" rel="nofollow" onmousedown="this.href=&#39;http://www.google.com/url?q\x3dhttp%3A%2F%2Ftwitter.com%2Fapr\x26sa\x3dD\x26sntz\x3d1\x26usg\x3dAFQjCNFRt8creb486OVHOJ12erdzV1NRIg&#39;;return true;" onclick="this.href=&#39;http://www.google.com/url?q\x3dhttp%3A%2F%2Ftwitter.com%2Fapr\x26sa\x3dD\x26sntz\x3d1\x26usg\x3dAFQjCNFRt8creb486OVHOJ12erdzV1NRIg&#39;;return true;">@apr

On Sun, May 7, 2017 at 7:29 AM, Janta Darbar <<a href="javascript:" target="_blank" gdf-obfuscated-mailto="ULxhMxBjAgAJ" rel="nofollow" onmousedown="this.href=&#39;javascript:&#39;;return true;" onclick="this.href=&#39;javascript:&#39;;return true;">dilli...@...> wrote:
Hi Alejjandro,

Thanks. I tried few combinations to arrive at this conclusion. 

Others may try in their windows setup and confirm.





On Saturday, May 6, 2017 at 5:39:03 PM UTC-5, Alejandro Revilla wrote:
Hi Jantar,

Thank you very much for this test. 

Are you positive you need both properties to be true in order to get this working on Windows?


--
<a style="font-family:garamond,serif" href="http://twitter.com/apr" rel="nofollow" target="_blank" onmousedown="this.href=&#39;http://www.google.com/url?q\x3dhttp%3A%2F%2Ftwitter.com%2Fapr\x26sa\x3dD\x26sntz\x3d1\x26usg\x3dAFQjCNFRt8creb486OVHOJ12erdzV1NRIg&#39;;return true;" onclick="this.href=&#39;http://www.google.com/url?q\x3dhttp%3A%2F%2Ftwitter.com%2Fapr\x26sa\x3dD\x26sntz\x3d1\x26usg\x3dAFQjCNFRt8creb486OVHOJ12erdzV1NRIg&#39;;return true;">@apr

On Sat, May 6, 2017 at 1:50 AM, Janta Darbar <[hidden email]> wrote:
I changed the boolean values to "true"  in following lines in "modules\qi-core\build.gradle"  file : 

manageDependencies = true
vaadinCompile.gwtSdkFirstInClasspath=true

Now, the jposee 'gradle build'  in Windows environment is successful.

Kind regards,
Raj


On Tuesday, May 2, 2017 at 2:40:34 PM UTC-5, Alejandro Revilla wrote:
Dave was kind enough to provide a fix for the BinLog issue and it now builds OK in Windows (<a href="https://github.com/jpos/jPOS/pull/128" rel="nofollow" target="_blank" onmousedown="this.href=&#39;https://www.google.com/url?q\x3dhttps%3A%2F%2Fgithub.com%2Fjpos%2FjPOS%2Fpull%2F128\x26sa\x3dD\x26sntz\x3d1\x26usg\x3dAFQjCNGpjYmL4HnGV6519l1BWO9gIpWVOw&#39;;return true;" onclick="this.href=&#39;https://www.google.com/url?q\x3dhttps%3A%2F%2Fgithub.com%2Fjpos%2FjPOS%2Fpull%2F128\x26sa\x3dD\x26sntz\x3d1\x26usg\x3dAFQjCNGpjYmL4HnGV6519l1BWO9gIpWVOw&#39;;return true;">https://github.com/jpos/jPOS/pull/128).

The GWT issue doesn't show up in Jenkins/Windows so it must be something else.



--
<a style="font-family:garamond,serif" href="http://twitter.com/apr" rel="nofollow" target="_blank" onmousedown="this.href=&#39;http://www.google.com/url?q\x3dhttp%3A%2F%2Ftwitter.com%2Fapr\x26sa\x3dD\x26sntz\x3d1\x26usg\x3dAFQjCNFRt8creb486OVHOJ12erdzV1NRIg&#39;;return true;" onclick="this.href=&#39;http://www.google.com/url?q\x3dhttp%3A%2F%2Ftwitter.com%2Fapr\x26sa\x3dD\x26sntz\x3d1\x26usg\x3dAFQjCNFRt8creb486OVHOJ12erdzV1NRIg&#39;;return true;">@apr

On Sat, Apr 29, 2017 at 2:11 AM, chhil <[hidden email]> wrote:
I tried getting various zips for build till <a href="https://github.com/jpos/jPOS-EE/tree/6dba6c83c867b207123b28a052d53fe6188ae934" rel="nofollow" target="_blank" onmousedown="this.href=&#39;https://www.google.com/url?q\x3dhttps%3A%2F%2Fgithub.com%2Fjpos%2FjPOS-EE%2Ftree%2F6dba6c83c867b207123b28a052d53fe6188ae934\x26sa\x3dD\x26sntz\x3d1\x26usg\x3dAFQjCNFTXyZrCxDBexkGhdoxgV1p5yP0hw&#39;;return true;" onclick="this.href=&#39;https://www.google.com/url?q\x3dhttps%3A%2F%2Fgithub.com%2Fjpos%2FjPOS-EE%2Ftree%2F6dba6c83c867b207123b28a052d53fe6188ae934\x26sa\x3dD\x26sntz\x3d1\x26usg\x3dAFQjCNFTXyZrCxDBexkGhdoxgV1p5yP0hw&#39;;return true;">https://github.com/jpos/jPOS-EE/tree/6dba6c83c867b207123b28a052d53fe6188ae934

I reached Sep 24 2016

​(sha 
6dba6c83c867b207123b28a052d53fe6188ae934
​)​

and could not build

​ (on Win10 Java 8)​
, though the build error was

Unexpected internal compiler error
java.lang.IncompatibleClassChangeError: class com.google.gwt.dev.javac.asm.CollectMethodData has interface org.objectweb.asm.MethodVisitor as super class
at java.lang.ClassLoader.defineClass1(Native Method)
at java.lang.ClassLoader.defineClass(ClassLoader.java:760)
at java.security.SecureClassLoader.defineClass(SecureClassLoader.java:142)
at java.net.URLClassLoader.defineClass(URLClassLoader.java:467)
at java.net.URLClassLoader.access$100(URLClassLoader.java:73)
...
...
:modules:qi-core:vaadinCompile FAILED
-chhil​





On Sat, Apr 29, 2017 at 10:03 AM, Barzilai Spinak <[hidden email]> wrote:
can anyone do a git bisect and find out which commit introduced the error?


On Friday, April 28, 2017, chhil <[hidden email]> wrote:

Got the zip via <a href="https://github.com/jpos/jPOS-EE/archive/master.zip" rel="nofollow" target="_blank" onmousedown="this.href=&#39;https://www.google.com/url?q\x3dhttps%3A%2F%2Fgithub.com%2Fjpos%2FjPOS-EE%2Farchive%2Fmaster.zip\x26sa\x3dD\x26sntz\x3d1\x26usg\x3dAFQjCNFSTIIJ3X5bIqb_PSkmk6HaZphGIQ&#39;;return true;" onclick="this.href=&#39;https://www.google.com/url?q\x3dhttps%3A%2F%2Fgithub.com%2Fjpos%2FjPOS-EE%2Farchive%2Fmaster.zip\x26sa\x3dD\x26sntz\x3d1\x26usg\x3dAFQjCNFSTIIJ3X5bIqb_PSkmk6HaZphGIQ&#39;;return true;">https://github.com/jpos/jPOS-EE/archive/master.zip

unzipped on win10 to C:\Temp\jPOS-EE-master and 

ran gradlew.bat ran gradlew install

got the error as seen by users in the thread.

Then used the same location as a mounted volume in my local docker image jpos/ubuntu_vivid_jdk8_unlimited 

docker run -t -i -v C:\Temp\jPOS-EE-master:/opt/jposee jpos/ubuntu_vivid_jdk8_unlimited

​​
ran ./gradlew ran ./gradlew install

Build generated.

-chhil  

On Fri, Apr 28, 2017 at 5:14 AM, adhi nugroho <[hidden email]> wrote:
yes..i have a same problem with that on windows 10 

Unexpected internal compiler error
java
.lang.RuntimeException: Unexpectedly unable to access Enum.createValueOfMap via reflection. Likely a dependency on the com.google.gwt.user.User module is missing.
at com
.google.gwt.dev.jjs.impl.GwtAstBuilder$AstVisitor.writeEnumValueOfMethod(GwtAstBuilder.java:2793)
at com
.google.gwt.dev.jjs.impl.GwtAstBuilder$AstVisitor.processEnumType(GwtAstBuilder.java:2425)
at com
.google.gwt.dev.jjs.impl.GwtAstBuilder$AstVisitor.endVisit(GwtAstBuilder.java:1861)
at com
.google.gwt.dev.jjs.impl.GwtAstBuilder$AstVisitor.endVisit(GwtAstBuilder.java:1588)
at org
.eclipse.jdt.internal.compiler.ast.TypeDeclaration.traverse(TypeDeclaration.java:1382)
at com
.google.gwt.dev.jjs.impl.GwtAstBuilder.process(GwtAstBuilder.java:3058)
at com
.google.gwt.dev.javac.CompilationStateBuilder$CompileMoreLater$UnitProcessorImpl.process(CompilationStateBuilder.java:141)


On Friday, April 28, 2017 at 5:23:58 AM UTC+7, Janta Darbar wrote:
Can anybody please confirm if they have installed latest JPosEE master in their windows machine?

-Raj



On Wednesday, April 26, 2017 at 9:08:17 PM UTC-5, Janta Darbar wrote:
my laptop is windows 10.

I downloaded the JPosEE Master and tried to Gradle install.

I am using gradle 3.5
java JDK : 1.8.0_121

>gradle install

It is throwing error as follows:

:modules:qi-core:vaadinCompile
Unexpected internal compiler error
java.lang.RuntimeException: Unexpectedly unable to access Enum.createValueOfMap via reflection. Likely a dependency on the com.google.gwt.user.User module is missing.
at <a href="http://com.google.gwt.dev.jjs.impl.Gw" rel="nofollow" target="_blank" onmousedown="this.href=&#39;http://www.google.com/url?q\x3dhttp%3A%2F%2Fcom.google.gwt.dev.jjs.impl.Gw\x26sa\x3dD\x26sntz\x3d1\x26usg\x3dAFQjCNGvRJR19AQt0TfIqvq7txcCEfSF0g&#39;;return true;" onclick="this.href=&#39;http://www.google.com/url?q\x3dhttp%3A%2F%2Fcom.google.gwt.dev.jjs.impl.Gw\x26sa\x3dD\x26sntz\x3d1\x26usg\x3dAFQjCNGvRJR19AQt0TfIqvq7txcCEfSF0g&#39;;return true;">com.google.gwt.dev.jjs.impl.GwtAstBuilder$AstVisitor.writeEnumValueOfMethod(GwtAstBuilder.java:2793)
at <a href="http://com.google.gwt.dev.jjs.impl.Gw" rel="nofollow" target="_blank" onmousedown="this.href=&#39;http://www.google.com/url?q\x3dhttp%3A%2F%2Fcom.google.gwt.dev.jjs.impl.Gw\x26sa\x3dD\x26sntz\x3d1\x26usg\x3dAFQjCNGvRJR19AQt0TfIqvq7txcCEfSF0g&#39;;return true;" onclick="this.href=&#39;http://www.google.com/url?q\x3dhttp%3A%2F%2Fcom.google.gwt.dev.jjs.impl.Gw\x26sa\x3dD\x26sntz\x3d1\x26usg\x3dAFQjCNGvRJR19AQt0TfIqvq7txcCEfSF0g&#39;;return true;">com.google.gwt.dev.jjs.impl.GwtAstBuilder$AstVisitor.processEnumType(GwtAstBuilder.java:2425)
at <a href="http://com.google.gwt.dev.jjs.impl.Gw" rel="nofollow" target="_blank" onmousedown="this.href=&#39;http://www.google.com/url?q\x3dhttp%3A%2F%2Fcom.google.gwt.dev.jjs.impl.Gw\x26sa\x3dD\x26sntz\x3d1\x26usg\x3dAFQjCNGvRJR19AQt0TfIqvq7txcCEfSF0g&#39;;return true;" onclick="this.href=&#39;http://www.google.com/url?q\x3dhttp%3A%2F%2Fcom.google.gwt.dev.jjs.impl.Gw\x26sa\x3dD\x26sntz\x3d1\x26usg\x3dAFQjCNGvRJR19AQt0TfIqvq7txcCEfSF0g&#39;;return true;">com.google.gwt.dev.jjs.impl.GwtAstBuilder$AstVisitor.endVisit(GwtAstBuilder.java:1861)
at <a href="http://com.google.gwt.dev.jjs.impl.Gw" rel="nofollow" target="_blank" onmousedown="this.href=&#39;http://www.google.com/url?q\x3dhttp%3A%2F%2Fcom.google.gwt.dev.jjs.impl.Gw\x26sa\x3dD\x26sntz\x3d1\x26usg\x3dAFQjCNGvRJR19AQt0TfIqvq7txcCEfSF0g&#39;;return true;" onclick="this.href=&#39;http://www.google.com/url?q\x3dhttp%3A%2F%2Fcom.google.gwt.dev.jjs.impl.Gw\x26sa\x3dD\x26sntz\x3d1\x26usg\x3dAFQjCNGvRJR19AQt0TfIqvq7txcCEfSF0g&#39;;return true;">com.google.gwt.dev.jjs.impl.GwtAstBuilder$AstVisitor.endVisit(GwtAstBuilder.java:1588)
at org.eclipse.jdt.internal.compiler.ast.TypeDeclaration.traverse(TypeDeclaration.java:1382)
at <a href="http://com.google.gwt.dev.jjs.impl.Gw" rel="nofollow" target="_blank" onmousedown="this.href=&#39;http://www.google.com/url?q\x3dhttp%3A%2F%2Fcom.google.gwt.dev.jjs.impl.Gw\x26sa\x3dD\x26sntz\x3d1\x26usg\x3dAFQjCNGvRJR19AQt0TfIqvq7txcCEfSF0g&#39;;return true;" onclick="this.href=&#39;http://www.google.com/url?q\x3dhttp%3A%2F%2Fcom.google.gwt.dev.jjs.impl.Gw\x26sa\x3dD\x26sntz\x3d1\x26usg\x3dAFQjCNGvRJR19AQt0TfIqvq7txcCEfSF0g&#39;;return true;">com.google.gwt.dev.jjs.impl.GwtAstBuilder.process(GwtAstBuilder.java:3058)
at com.google.gwt.dev.javac.CompilationStateBuilder$CompileMoreLater$UnitProcessorImpl.process(CompilationStateBuilder.java:141)
at com.google.gwt.dev.javac.JdtCompiler$CompilerImpl.process(JdtCompiler.java:384)
at org.eclipse.jdt.internal.compiler.Compiler.compile(Compiler.java:470)
at com.google.gwt.dev.javac.JdtCompiler.doCompile(JdtCompiler.java:985)
at com.google.gwt.dev.javac.CompilationStateBuilder$CompileMoreLater.compile(CompilationStateBuilder.java:339)
at com.google.gwt.dev.javac.CompilationStateBuilder.doBuildFrom(CompilationStateBuilder.java:580)
at com.google.gwt.dev.javac.CompilationStateBuilder.buildFrom(CompilationStateBuilder.java:513)
at com.google.gwt.dev.javac.CompilationStateBuilder.buildFrom(CompilationStateBuilder.java:499)
at com.google.gwt.dev.cfg.ModuleDef.getCompilationState(ModuleDef.java:668)
at com.google.gwt.dev.Precompile.precompile(Precompile.java:255)
at com.google.gwt.dev.Precompile.precompile(Precompile.java:229)
at com.google.gwt.dev.Precompile.precompile(Precompile.java:145)
at <a href="http://com.google.gwt.dev.Compiler.ru" rel="nofollow" target="_blank" onmousedown="this.href=&#39;http://www.google.com/url?q\x3dhttp%3A%2F%2Fcom.google.gwt.dev.Compiler.ru\x26sa\x3dD\x26sntz\x3d1\x26usg\x3dAFQjCNFXMquzc8TxB0aHR83Q3A5h350ARA&#39;;return true;" onclick="this.href=&#39;http://www.google.com/url?q\x3dhttp%3A%2F%2Fcom.google.gwt.dev.Compiler.ru\x26sa\x3dD\x26sntz\x3d1\x26usg\x3dAFQjCNFXMquzc8TxB0aHR83Q3A5h350ARA&#39;;return true;">com.google.gwt.dev.Compiler.run(Compiler.java:206)
at <a href="http://com.google.gwt.dev.Compiler.ru" rel="nofollow" target="_blank" onmousedown="this.href=&#39;http://www.google.com/url?q\x3dhttp%3A%2F%2Fcom.google.gwt.dev.Compiler.ru\x26sa\x3dD\x26sntz\x3d1\x26usg\x3dAFQjCNFXMquzc8TxB0aHR83Q3A5h350ARA&#39;;return true;" onclick="this.href=&#39;http://www.google.com/url?q\x3dhttp%3A%2F%2Fcom.google.gwt.dev.Compiler.ru\x26sa\x3dD\x26sntz\x3d1\x26usg\x3dAFQjCNFXMquzc8TxB0aHR83Q3A5h350ARA&#39;;return true;">com.google.gwt.dev.Compiler.run(Compiler.java:158)
at com.google.gwt.dev.Compiler$1.run(Compiler.java:120)
at com.google.gwt.dev.CompileTaskRunner.doRun(CompileTaskRunner.java:55)
at com.google.gwt.dev.CompileTaskRunner.runWithAppropriateLogger(CompileTaskRunner.java:50)
at <a href="http://com.google.gwt.dev.Compiler.ma" rel="nofollow" target="_blank" onmousedown="this.href=&#39;http://www.google.com/url?q\x3dhttp%3A%2F%2Fcom.google.gwt.dev.Compiler.ma\x26sa\x3dD\x26sntz\x3d1\x26usg\x3dAFQjCNE26rMIDLoGeU5tDGPG7zFu_NzTZQ&#39;;return true;" onclick="this.href=&#39;http://www.google.com/url?q\x3dhttp%3A%2F%2Fcom.google.gwt.dev.Compiler.ma\x26sa\x3dD\x26sntz\x3d1\x26usg\x3dAFQjCNE26rMIDLoGeU5tDGPG7zFu_NzTZQ&#39;;return true;">com.google.gwt.dev.Compiler.main(Compiler.java:127)
:modules:qi-core:vaadinCompile FAILED

FAILURE: Build failed with an exception.

* What went wrong:
Execution failed for task ':modules:qi-core:vaadinCompile'.
> Widgetset failed to compile. See error log.


Am I missing anything??

- Rajesh

--
--
jPOS is licensed under AGPL - free for community usage for your open-source project. Licenses are also available for commercial usage. Please support jPOS, contact: [hidden email]
---
You received this message because you are subscribed to the Google Groups "jPOS Users" group.
To unsubscribe from this group and stop receiving emails from it, send an email to jpos-users+unsubscribe@googlegroups.com.
To post to this group, send email to [hidden email].
To view this discussion on the web visit <a href="https://groups.google.com/d/msgid/jpos-users/3c01d42c-0a03-4dd5-8ed4-bbf4eafcf96d%40googlegroups.com?utm_medium=email&amp;utm_source=footer" rel="nofollow" target="_blank" onmousedown="this.href=&#39;https://groups.google.com/d/msgid/jpos-users/3c01d42c-0a03-4dd5-8ed4-bbf4eafcf96d%40googlegroups.com?utm_medium\x3demail\x26utm_source\x3dfooter&#39;;return true;" onclick="this.href=&#39;https://groups.google.com/d/msgid/jpos-users/3c01d42c-0a03-4dd5-8ed4-bbf4eafcf96d%40googlegroups.com?utm_medium\x3demail\x26utm_source\x3dfooter&#39;;return true;">https://groups.google.com/d/msgid/jpos-users/3c01d42c-0a03-4dd5-8ed4-bbf4eafcf96d%40googlegroups.com.

For more options, visit <a href="https://groups.google.com/d/optout" rel="nofollow" target="_blank" onmousedown="this.href=&#39;https://groups.google.com/d/optout&#39;;return true;" onclick="this.href=&#39;https://groups.google.com/d/optout&#39;;return true;">https://groups.google.com/d/optout.

--
--
jPOS is licensed under AGPL - free for community usage for your open-source project. Licenses are also available for commercial usage. Please support jPOS, contact: [hidden email]
---
You received this message because you are subscribed to the Google Groups "jPOS Users" group.
To unsubscribe from this group and stop receiving emails from it, send an email to jpos-users+unsubscribe@googlegroups.com.
To post to this group, send email to [hidden email].
To view this discussion on the web visit <a href="https://groups.google.com/d/msgid/jpos-users/CAPazefAjVkfx7qD6iP300UC3fkm_n60aKcznZnVvDd%2B9Zvff%3Dg%40mail.gmail.com?utm_medium=email&amp;utm_source=footer" rel="nofollow" target="_blank" onmousedown="this.href=&#39;https://groups.google.com/d/msgid/jpos-users/CAPazefAjVkfx7qD6iP300UC3fkm_n60aKcznZnVvDd%2B9Zvff%3Dg%40mail.gmail.com?utm_medium\x3demail\x26utm_source\x3dfooter&#39;;return true;" onclick="this.href=&#39;https://groups.google.com/d/msgid/jpos-users/CAPazefAjVkfx7qD6iP300UC3fkm_n60aKcznZnVvDd%2B9Zvff%3Dg%40mail.gmail.com?utm_medium\x3demail\x26utm_source\x3dfooter&#39;;return true;">https://groups.google.com/d/msgid/jpos-users/CAPazefAjVkfx7qD6iP300UC3fkm_n60aKcznZnVvDd%2B9Zvff%3Dg%40mail.gmail.com.
For more options, visit <a href="https://groups.google.com/d/optout" rel="nofollow" target="_blank" onmousedown="this.href=&#39;https://groups.google.com/d/optout&#39;;return true;" onclick="this.href=&#39;https://groups.google.com/d/optout&#39;;return true;">https://groups.google.com/d/optout.


--
Barzilai Spinak
Transactility, Inc.
<a href="http://www.transactility.com" rel="nofollow" target="_blank" onmousedown="this.href=&#39;http://www.google.com/url?q\x3dhttp%3A%2F%2Fwww.transactility.com\x26sa\x3dD\x26sntz\x3d1\x26usg\x3dAFQjCNH2Sie_sItmzefqi-CBIeBxkqnuwQ&#39;;return true;" onclick="this.href=&#39;http://www.google.com/url?q\x3dhttp%3A%2F%2Fwww.transactility.com\x26sa\x3dD\x26sntz\x3d1\x26usg\x3dAFQjCNH2Sie_sItmzefqi-CBIeBxkqnuwQ&#39;;return true;">www.transactility.com
"Commercial licensing and support for the jPOS.org project"

--
--
jPOS is licensed under AGPL - free for community usage for your open-source project. Licenses are also available for commercial usage. Please support jPOS, contact: [hidden email]
---
You received this message because you are subscribed to the Google Groups "jPOS Users" group.
To unsubscribe from this group and stop receiving emails from it, send an email to jpos-users+...@googlegroups.com.
To post to this group, send email to [hidden email].
To view this discussion on the web visit <a href="https://groups.google.com/d/msgid/jpos-users/CAMUbAtzBtWE%2BEDYSYrwDc6UefkhSF3BePP04HLZbvhROU%2BcErQ%40mail.gmail.com?utm_medium=email&amp;utm_source=footer" rel="nofollow" target="_blank" onmousedown="this.href=&#39;https://groups.google.com/d/msgid/jpos-users/CAMUbAtzBtWE%2BEDYSYrwDc6UefkhSF3BePP04HLZbvhROU%2BcErQ%40mail.gmail.com?utm_medium\x3demail\x26utm_source\x3dfooter&#39;;return true;" onclick="this.href=&#39;https://groups.google.com/d/msgid/jpos-users/CAMUbAtzBtWE%2BEDYSYrwDc6UefkhSF3BePP04HLZbvhROU%2BcErQ%40mail.gmail.com?utm_medium\x3demail\x26utm_source\x3dfooter&#39;;return true;">https://groups.google.com/d/msgid/jpos-users/CAMUbAtzBtWE%2BEDYSYrwDc6UefkhSF3BePP04HLZbvhROU%2BcErQ%40mail.gmail.com.

For more options, visit <a href="https://groups.google.com/d/optout" rel="nofollow" target="_blank" onmousedown="this.href=&#39;https://groups.google.com/d/optout&#39;;return true;" onclick="this.href=&#39;https://groups.google.com/d/optout&#39;;return true;">https://groups.google.com/d/optout.

--
--
jPOS is licensed under AGPL - free for community usage for your open-source project. Licenses are also available for commercial usage. Please support jPOS, contact: [hidden email]
---
You received this message because you are subscribed to the Google Groups "jPOS Users" group.
To unsubscribe from this group and stop receiving emails from it, send an email to jpos-users+...@googlegroups.com.
To post to this group, send email to [hidden email].
To view this discussion on the web visit <a href="https://groups.google.com/d/msgid/jpos-users/CAPazefAHiuwGmsiEH1ROK6KQFNiC%3DobS7NpPmespY8rArwfM0A%40mail.gmail.com?utm_medium=email&amp;utm_source=footer" rel="nofollow" target="_blank" onmousedown="this.href=&#39;https://groups.google.com/d/msgid/jpos-users/CAPazefAHiuwGmsiEH1ROK6KQFNiC%3DobS7NpPmespY8rArwfM0A%40mail.gmail.com?utm_medium\x3demail\x26utm_source\x3dfooter&#39;;return true;" onclick="this.href=&#39;https://groups.google.com/d/msgid/jpos-users/CAPazefAHiuwGmsiEH1ROK6KQFNiC%3DobS7NpPmespY8rArwfM0A%40mail.gmail.com?utm_medium\x3demail\x26utm_source\x3dfooter&#39;;return true;">https://groups.google.com/d/msgid/jpos-users/CAPazefAHiuwGmsiEH1ROK6KQFNiC%3DobS7NpPmespY8rArwfM0A%40mail.gmail.com.

For more options, visit <a href="https://groups.google.com/d/optout" rel="nofollow" target="_blank" onmousedown="this.href=&#39;https://groups.google.com/d/optout&#39;;return true;" onclick="this.href=&#39;https://groups.google.com/d/optout&#39;;return true;">https://groups.google.com/d/optout.

--
--
jPOS is licensed under AGPL - free for community usage for your open-source project. Licenses are also available for commercial usage. Please support jPOS, contact: [hidden email]
---
You received this message because you are subscribed to the Google Groups "jPOS Users" group.
To unsubscribe from this group and stop receiving emails from it, send an email to jpos-users+...@googlegroups.com.
To post to this group, send email to [hidden email].
To view this discussion on the web visit <a href="https://groups.google.com/d/msgid/jpos-users/ec7c6821-c283-4c85-ba0b-876bae1d3c18%40googlegroups.com?utm_medium=email&amp;utm_source=footer" rel="nofollow" target="_blank" onmousedown="this.href=&#39;https://groups.google.com/d/msgid/jpos-users/ec7c6821-c283-4c85-ba0b-876bae1d3c18%40googlegroups.com?utm_medium\x3demail\x26utm_source\x3dfooter&#39;;return true;" onclick="this.href=&#39;https://groups.google.com/d/msgid/jpos-users/ec7c6821-c283-4c85-ba0b-876bae1d3c18%40googlegroups.com?utm_medium\x3demail\x26utm_source\x3dfooter&#39;;return true;">https://groups.google.com/d/msgid/jpos-users/ec7c6821-c283-4c85-ba0b-876bae1d3c18%40googlegroups.com.
For more options, visit <a href="https://groups.google.com/d/optout" rel="nofollow" target="_blank" onmousedown="this.href=&#39;https://groups.google.com/d/optout&#39;;return true;" onclick="this.href=&#39;https://groups.google.com/d/optout&#39;;return true;">https://groups.google.com/d/optout.

--
--
jPOS is licensed under AGPL - free for community usage for your open-source project. Licenses are also available for commercial usage. Please support jPOS, contact: <a href="javascript:" target="_blank" gdf-obfuscated-mailto="ULxhMxBjAgAJ" rel="nofollow" onmousedown="this.href=&#39;javascript:&#39;;return true;" onclick="this.href=&#39;javascript:&#39;;return true;">sa...@...
---
You received this message because you are subscribed to the Google Groups "jPOS Users" group.
To unsubscribe from this group and stop receiving emails from it, send an email to <a href="javascript:" target="_blank" gdf-obfuscated-mailto="ULxhMxBjAgAJ" rel="nofollow" onmousedown="this.href=&#39;javascript:&#39;;return true;" onclick="this.href=&#39;javascript:&#39;;return true;">jpos-users+...@googlegroups.com.
To post to this group, send email to <a href="javascript:" target="_blank" gdf-obfuscated-mailto="ULxhMxBjAgAJ" rel="nofollow" onmousedown="this.href=&#39;javascript:&#39;;return true;" onclick="this.href=&#39;javascript:&#39;;return true;">jpos-...@....
To view this discussion on the web visit <a href="https://groups.google.com/d/msgid/jpos-users/c2c2f687-845c-4b62-844c-c7f7c39c7799%40googlegroups.com?utm_medium=email&amp;utm_source=footer" target="_blank" rel="nofollow" onmousedown="this.href=&#39;https://groups.google.com/d/msgid/jpos-users/c2c2f687-845c-4b62-844c-c7f7c39c7799%40googlegroups.com?utm_medium\x3demail\x26utm_source\x3dfooter&#39;;return true;" onclick="this.href=&#39;https://groups.google.com/d/msgid/jpos-users/c2c2f687-845c-4b62-844c-c7f7c39c7799%40googlegroups.com?utm_medium\x3demail\x26utm_source\x3dfooter&#39;;return true;">https://groups.google.com/d/msgid/jpos-users/c2c2f687-845c-4b62-844c-c7f7c39c7799%40googlegroups.com.

For more options, visit <a href="https://groups.google.com/d/optout" target="_blank" rel="nofollow" onmousedown="this.href=&#39;https://groups.google.com/d/optout&#39;;return true;" onclick="this.href=&#39;https://groups.google.com/d/optout&#39;;return true;">https://groups.google.com/d/optout.

--
--
jPOS is licensed under AGPL - free for community usage for your open-source project. Licenses are also available for commercial usage. Please support jPOS, contact: [hidden email]
---
You received this message because you are subscribed to the Google Groups "jPOS Users" group.
To unsubscribe from this group and stop receiving emails from it, send an email to [hidden email].
To post to this group, send email to [hidden email].
To view this discussion on the web visit https://groups.google.com/d/msgid/jpos-users/db322c6c-9524-438d-affa-4fc8c1b1e80c%40googlegroups.com.
For more options, visit https://groups.google.com/d/optout.